{"text_format":"1","workbook":"xlsx","n_sheets":18,"sheets":["Instructions","INFO","UPLOAD","W1","W2","W3","W4","W5","W6","W7","W8","W9","W10","SUBMIT REPORT","SUMMARY","Payout Calc","Memberships","SupportData"],"not_rendered":{"charts":0,"images":2,"macros":1,"external_links":2,"defined_names":79,"comments":2,"pivot_tables":0},"unopened":[],"bounds":{"document_bytes":16777216,"sheet_cells":100000,"rows_first":2000,"rows_last":500,"rows_between":2000,"halvings":0,"cell_chars":16384,"cell_head_chars":4096},"cells_cut":0,"cells_raw":0,"read":"whole","date_system":"1900"}

{"sheet":"Instructions","index":0,"n_rows":61,"n_cols":17,"rows_kept":61,"cut":false,"hidden":false,"merged":[[15,1,15,2],[3,4,3,14],[4,12,4,14],[4,15,4,17]]}
[]
[null,null,"Guide to the PDGA League Report"]
[null,null,"Excel Version 18.4b"]
[null,null,"Dear PDGA League Director,",null,"  Division Codes: Use the following 3 or 4 character codes in the DivCode field."]
[null,null,null,null,"PROFESSIONAL DIVISIONS",null,null,null,"AMATEUR DIVISIONS",null,null,null,"RATINGS DIVISIONS",null,null,"JUNIOR DIVISIONS"]
[null,null,"Thanks for directing a PDGA League! This version of the League Report has been updated to MS Excel 2007+",null,"MPO","Open",null,null,"MA1","Advanced",null,null,"Code","Color","Rating","MJ18","Junior Boys < 18"]
[null,null,"to provide wider compatibillity. TDs who do not have Excel* or are unable to report in this format are ",null,"MP40","Master Pro 40+",null,null,"MA2","Intermediate",null,null,"RPA","Gold","970+","MJ15","Junior Boys < 15"]
[null,null,"requested to forward this file and assign the task of reporting to a local club member or event volunteer who ",null,"MP50","Master Pro 50+",null,null,"MA3","Recreational",null,null,"RAH","Blue","<970","MJ12","Junior Boys < 12"]
{"$rows_left_out":54}
{"sheet":"INFO","index":1,"n_rows":24,"n_cols":23,"rows_kept":24,"cut":false,"hidden":false,"merged":[[18,16,18,18],[0,18,0,20],[0,2,0,6],[1,18,1,20],[1,2,1,5],[1,8,1,10],[11,16,11,18],[12,16,12,18],[2,8,2,16],[2,2,2,5],[9,10,9,14],[9,16,9,18],[10,16,10,18],[3,2,3,5],[4,6,4,20],[6,0,6,5],[26,0,26,20],[27,0,27,20],[19,16,19,18],[20,16,20,18],[24,0,24,20],[25,0,25,20],[22,0,22,5],[20,22,20,24],[14,16,14,18],[10,22,10,24],[11,22,11,24],[12,22,12,24],[13,22,13,24],[14,22,14,24],[15,22,15,24],[16,22,16,24],[17,22,17,24],[18,22,18,24],[19,22,19,24],[17,16,17,18],[13,16,13,18],[15,16,15,18],[16,16,16,18]]}
[null,"League Name: ",null,null,null,null,null,"12.0.0",null,null,null,null,null,null,null,null,null,"# of Weeks: "]
[null,"League TD: ",null,null,null,null,null,"League Director PDGA # ",null,null,null,null,null,null,null,null,null,"Starting Date: "]
[null,"Main City: ",null,null,null,null,null,"Email Address: ","@"]
[null,"State / Prv: "]
[null,null,null,null,null,"Optional - How do $ amounts in your entry fee break out: "]
[]
["COURSES & LAYOUTS",null,null,null,null,null,null,null,"Link to PDGA Course Directory >",null,"http://www.pdga.com/course_directory"]
["It is important to enter course layout information accurately so your players get their ratings processed correctly."]
{"$rows_left_out":17}
{"sheet":"UPLOAD","index":2,"n_rows":325,"n_cols":22,"rows_kept":325,"cut":false,"hidden":false,"merged":[[0,11,0,15],[0,0,0,2],[3,19,3,20],[62,19,62,21],[48,19,48,21],[40,19,40,20],[2,0,3,1],[14,19,14,22]]}
["LEAGUE UPLOAD PAGE",null,null,"  (Scroll to right for Instructions)",null,null,null,null,null,null,"League Name: ",{"$f":"IF(INFO!C1=\"\",\"\",INFO!C1)","v":""},null,null,null,null,null,null,null,"PDGA Upload site:",null,"http://www.pdga.com/tournament/manager"]
[]
[" Click here to see\n Division Codes",null,null,null,{"$f":"IF(E4<>'W1'!$E3,\"ERR!\",\"\")","v":""},{"$f":"IF(F4<>'W2'!$E3,\"ERR!\",\"\")","v":""},{"$f":"IF(G4<>'W3'!$E3,\"ERR!\",\"\")","v":""},{"$f":"IF(H4<>'W4'!$E3,\"ERR!\",\"\")","v":""},{"$f":"IF(I4<>'W5'!$E3,\"ERR!\",\"\")","v":""},{"$f":"IF(J4<>'W6'!$E3,\"ERR!\",\"\")","v":""},{"$f":"IF(K4<>'W7'!$E3,\"ERR!\",\"\")","v":""},{"$f":"IF(L4<>'W8'!$E3,\"ERR!\",\"\")","v":""},{"$f":"IF(M4<>'W9'!$E3,\"ERR!\",\"\")","v":""},{"$f":"IF(N4<>'W10'!$E3,\"ERR!\",\"\")","v":""}]
[null,null,null,"# Played > ",{"$f":"COUNTIF(E6:E325,\">0\")","v":0},{"$f":"COUNTIF(F6:F325,\">0\")","v":0},0,0,0,0,0,0,0,0,"Play",null,null,null,null,"INSTRUCTIONS"]
["DivCode","First","Last","PDGA #","R1","R2","R3","R4","R5","R6","R7","R8","R9","R10","This Wk?","PDGA #    or Code","Dupes\n?",null,null,"This Upload page is the master list of all players who entered your league and their"]
[null,null,null,{"$f":"IF(P6=\"\",\"\",IF(ISERR(VALUE(P6)),\"\",P6))","v":""},{"$f":"IF(OR(ISERROR(VLOOKUP($P6,W1D,1,FALSE)),ISBLANK(VLOOKUP($P6,W1D,2,FALSE))),\"\",VLOOKUP($P6,W1D,2,FALSE))","v":""},{"$f":"IF(OR(ISERROR(VLOOKUP($P6,W2D,1,FALSE)),ISBLANK(VLOOKUP($P6,W2D,2,FALSE))),\"\",VLOOKUP($P6,W2D,2,FALSE))","v":""},{"$f":"IF(OR(ISERROR(VLOOKUP($P6,W3D,1,FALSE)),ISBLANK(VLOOKUP($P6,W3D,2,FALSE))),\"\",VLOOKUP($P6,W3D,2,FALSE))","v":""},{"$f":"IF(OR(ISERROR(VLOOKUP($P6,W4D,1,FALSE)),ISBLANK(VLOOKUP($P6,W4D,2,FALSE))),\"\",VLOOKUP($P6,W4D,2,FALSE))","v":""},{"$f":"IF(OR(ISERROR(VLOOKUP($P6,W5D,1,FALSE)),ISBLANK(VLOOKUP($P6,W5D,2,FALSE))),\"\",VLOOKUP($P6,W5D,2,FALSE))","v":""},{"$f":"IF(OR(ISERROR(VLOOKUP($P6,W6D,1,FALSE)),ISBLANK(VLOOKUP($P6,W6D,2,FALSE))),\"\",VLOOKUP($P6,W6D,2,FALSE))","v":""},{"$f":"IF(OR(ISERROR(VLOOKUP($P6,W7D,1,FALSE)),ISBLANK(VLOOKUP($P6,W7D,2,FALSE))),\"\",VLOOKUP($P6,W7D,2,FALSE))","v":""},{"$f":"IF(OR(ISERROR(VLOOKUP($P6,W8D,1,FALSE)),ISBLANK(VLOOKUP($P6,W8D,2,FALSE))),\"\",VLOOKUP($P6,W8D,2,FALSE))","v":""},{"$f":"IF(OR(ISERROR(VLOOKUP($P6,W9D,1,FALSE)),ISBLANK(VLOOKUP($P6,W9D,2,FALSE))),\"\",VLOOKUP($P6,W9D,2,FALSE))","v":""},{"$f":"IF(OR(ISERROR(VLOOKUP($P6,W10D,1,FALSE)),ISBLANK(VLOOKUP($P6,W10D,2,FALSE))),\"\",VLOOKUP($P6,W10D,2,FALSE))","v":""},null,null,{"$f":"IF(COUNTIF(P$6:P$325,P6)>1,\"<Dup!\",\"\")","v":""},null,null,"scores. You upload this page weekly to the PDGA website to generate Preview"]
[null,null,null,"","","","","","","","","","","",null,null,"",null,null,"(unofficial) Ratings online until the league is completed and this report is filed with PDGA."]
[null,null,null,"","","","","","","","","","","",null,null,"",null,null,"Enter the name of every player who plays in your league. Enter it even if they didn't"]
{"$rows_left_out":318}
{"sheet":"W1","index":3,"n_rows":23,"n_cols":11,"rows_kept":23,"cut":false,"hidden":false,"merged":[[0,5,0,8],[1,1,1,2],[1,5,1,8],[2,0,2,2]]}
["Date: ",{"$f":"IF(INFO!B12=\"\",\"\",INFO!B12)","v":""},"Week 1",null,"League: ",{"$f":"IF(INFO!C1=\"\",\"\",INFO!C1)","v":""}]
["Course: ",{"$f":"IF(INFO!E12=\"\",\"\",INFO!E12)","v":""},null,null,"Layout: ",{"$f":"IF(INFO!G12=\"\",\"\",INFO!G12)","v":""}]
["** Enter New Players First on UPLOAD page **",null,null,null,{"$f":"COUNTIF(E6:E186,\">0\")","v":0}," = Number who Played",null,null,null,null,"Instructions"]
[null,null,null,"PDGA","Round",null,null,null,"Div",null,"These weekly pages are designed to help you run your league each week."]
["DivCode","First Name","Last Name","or Code","Score","Opt.","Opt.","Opt.","Rank",null,"You may relabel columns F thru I and insert formulas in those columns to"]
[null,null,null,null,null,null,null,null,null,null,"do whatever kind of points, payout or handicap calculations you wish."]
[null,null,null,null,null,null,null,null,null,null,"You may even insert more columns after Column I if you need them."]
[null,null,null,null,null,null,null,null,null,null,"Please do not fiddle with columns A thru E nor insert more rows."]
{"$rows_left_out":16}
{"sheet":"W2","index":4,"n_rows":24,"n_cols":11,"rows_kept":24,"cut":false,"hidden":false,"merged":[[0,5,0,8],[1,1,1,2],[1,5,1,8],[2,0,2,2]]}
["Date: ",{"$f":"IF(INFO!B13=\"\",\"\",INFO!B13)","v":""},"Week 2",null,"League: ",{"$f":"IF(INFO!C1=\"\",\"\",INFO!C1)","v":""}]
["Course: ",{"$f":"IF(INFO!E13=\"\",\"\",INFO!E13)","v":""},null,null,"Layout: ",{"$f":"IF(INFO!G13=\"\",\"\",INFO!G13)","v":""}]
["** Enter New Players First on UPLOAD page **",null,null,null,{"$f":"COUNTIF(E6:E186,\">0\")","v":0}," = Number who Played",null,null,null,null,"Instructions"]
[null,null,null,"PDGA","Round",null,null,null,"Div",null,"These weekly pages are designed to help you run your league each week."]
["DivCode","First Name","Last Name","or Code","Score","Opt.","Opt.","Opt.","Rank",null,"You may relabel columns F thru I and insert formulas in those columns to"]
[null,null,null,null,null,null,null,null,null,null,"do whatever kind of points, payout or handicap calculations you wish."]
[null,null,null,null,null,null,null,null,null,null,"You may even insert more columns after Column I if you need them."]
[null,null,null,null,null,null,null,null,null,null,"Please do not fiddle with columns A thru E nor insert more rows."]
{"$rows_left_out":17}
{"sheet":"W3","index":5,"n_rows":24,"n_cols":11,"rows_kept":24,"cut":false,"hidden":false,"merged":[[0,5,0,8],[1,1,1,2],[1,5,1,8],[2,0,2,2]]}
["Date: ",{"$f":"IF(INFO!B14=\"\",\"\",INFO!B14)","v":""},"Week 3",null,"League: ",{"$f":"IF(INFO!C1=\"\",\"\",INFO!C1)","v":""}]
["Course: ",{"$f":"IF(INFO!E14=\"\",\"\",INFO!E14)","v":""},null,null,"Layout: ",{"$f":"IF(INFO!G14=\"\",\"\",INFO!G14)","v":""}]
["** Enter New Players First on UPLOAD page **",null,null,null,{"$f":"COUNTIF(E6:E186,\">0\")","v":0}," = Number who Played",null,null,null,null,"Instructions"]
[null,null,null,"PDGA","Round",null,null,null,"Div",null,"These weekly pages are designed to help you run your league each week."]
["DivCode","First Name","Last Name","or Code","Score","Opt.","Opt.","Opt.","Rank",null,"You may relabel columns F thru I and insert formulas in those columns to"]
[null,null,null,null,null,null,null,null,null,null,"do whatever kind of points, payout or handicap calculations you wish."]
[null,null,null,null,null,null,null,null,null,null,"You may even insert more columns after Column I if you need them."]
[null,null,null,null,null,null,null,null,null,null,"Please do not fiddle with columns A thru E nor insert more rows."]
{"$rows_left_out":17}
{"sheet":"W4","index":6,"n_rows":24,"n_cols":11,"rows_kept":24,"cut":false,"hidden":false,"merged":[[0,5,0,8],[1,1,1,2],[1,5,1,8],[2,0,2,2]]}
["Date: ",{"$f":"IF(INFO!B15=\"\",\"\",INFO!B15)","v":""},"Week 4",null,"League: ",{"$f":"IF(INFO!C1=\"\",\"\",INFO!C1)","v":""}]
["Course: ",{"$f":"IF(INFO!E15=\"\",\"\",INFO!E15)","v":""},null,null,"Layout: ",{"$f":"IF(INFO!G15=\"\",\"\",INFO!G15)","v":""}]
["** Enter New Players First on UPLOAD page **",null,null,null,{"$f":"COUNTIF(E6:E186,\">0\")","v":0}," = Number who Played",null,null,null,null,"Instructions"]
[null,null,null,"PDGA","Round",null,null,null,"Div",null,"These weekly pages are designed to help you run your league each week."]
["DivCode","First Name","Last Name","or Code","Score","Opt.","Opt.","Opt.","Rank",null,"You may relabel columns F thru I and insert formulas in those columns to"]
[null,null,null,null,null,null,null,null,null,null,"do whatever kind of points, payout or handicap calculations you wish."]
[null,null,null,null,null,null,null,null,null,null,"You may even insert more columns after Column I if you need them."]
[null,null,null,null,null,null,null,null,null,null,"Please do not fiddle with columns A thru E nor insert more rows."]
{"$rows_left_out":17}
{"sheet":"W5","index":7,"n_rows":24,"n_cols":11,"rows_kept":24,"cut":false,"hidden":false,"merged":[[0,5,0,8],[1,1,1,2],[1,5,1,8],[2,0,2,2]]}
["Date: ",{"$f":"IF(INFO!B16=\"\",\"\",INFO!B16)","v":""},"Week 5",null,"League: ",{"$f":"IF(INFO!C1=\"\",\"\",INFO!C1)","v":""}]
["Course: ",{"$f":"IF(INFO!E16=\"\",\"\",INFO!E16)","v":""},null,null,"Layout: ",{"$f":"IF(INFO!G16=\"\",\"\",INFO!G16)","v":""}]
["** Enter New Players First on UPLOAD page **",null,null,null,{"$f":"COUNTIF(E6:E186,\">0\")","v":0}," = Number who Played",null,null,null,null,"Instructions"]
[null,null,null,"PDGA","Round",null,null,null,"Div",null,"These weekly pages are designed to help you run your league each week."]
["DivCode","First Name","Last Name","or Code","Score","Opt.","Opt.","Opt.","Rank",null,"You may relabel columns F thru I and insert formulas in those columns to"]
[null,null,null,null,null,null,null,null,null,null,"do whatever kind of points, payout or handicap calculations you wish."]
[null,null,null,null,null,null,null,null,null,null,"You may even insert more columns after Column I if you need them."]
[null,null,null,null,null,null,null,null,null,null,"Please do not fiddle with columns A thru E nor insert more rows."]
{"$rows_left_out":17}
{"sheet":"W6","index":8,"n_rows":24,"n_cols":11,"rows_kept":24,"cut":false,"hidden":false,"merged":[[0,5,0,8],[1,1,1,2],[1,5,1,8],[2,0,2,2]]}
["Date: ",{"$f":"IF(INFO!B17=\"\",\"\",INFO!B17)","v":""},"Week 6",null,"League: ",{"$f":"IF(INFO!C1=\"\",\"\",INFO!C1)","v":""}]
["Course: ",{"$f":"IF(INFO!E17=\"\",\"\",INFO!E17)","v":""},null,null,"Layout: ",{"$f":"IF(INFO!G17=\"\",\"\",INFO!G17)","v":""}]
["** Enter New Players First on UPLOAD page **",null,null,null,{"$f":"COUNTIF(E6:E186,\">0\")","v":0}," = Number who Played",null,null,null,null,"Instructions"]
[null,null,null,"PDGA","Round",null,null,null,"Div",null,"These weekly pages are designed to help you run your league each week."]
["DivCode","First Name","Last Name","or Code","Score","Opt.","Opt.","Opt.","Rank",null,"You may relabel columns F thru I and insert formulas in those columns to"]
[null,null,null,null,null,null,null,null,null,null,"do whatever kind of points, payout or handicap calculations you wish."]
[null,null,null,null,null,null,null,null,null,null,"You may even insert more columns after Column I if you need them."]
[null,null,null,null,null,null,null,null,null,null,"Please do not fiddle with columns A thru E nor insert more rows."]
{"$rows_left_out":17}
{"sheet":"W7","index":9,"n_rows":24,"n_cols":11,"rows_kept":24,"cut":false,"hidden":false,"merged":[[0,5,0,8],[1,1,1,2],[1,5,1,8],[2,0,2,2]]}
["Date: ",{"$f":"IF(INFO!B18=\"\",\"\",INFO!B18)","v":""},"Week 7",null,"League: ",{"$f":"IF(INFO!C1=\"\",\"\",INFO!C1)","v":""}]
["Course: ",{"$f":"IF(INFO!E18=\"\",\"\",INFO!E18)","v":""},null,null,"Layout: ",{"$f":"IF(INFO!G18=\"\",\"\",INFO!G18)","v":""}]
["** Enter New Players First on UPLOAD page **",null,null,null,{"$f":"COUNTIF(E6:E186,\">0\")","v":0}," = Number who Played",null,null,null,null,"Instructions"]
[null,null,null,"PDGA","Round",null,null,null,"Div",null,"These weekly pages are designed to help you run your league each week."]
["DivCode","First Name","Last Name","or Code","Score","Opt.","Opt.","Opt.","Rank",null,"You may relabel columns F thru I and insert formulas in those columns to"]
[null,null,null,null,null,null,null,null,null,null,"do whatever kind of points, payout or handicap calculations you wish."]
[null,null,null,null,null,null,null,null,null,null,"You may even insert more columns after Column I if you need them."]
[null,null,null,null,null,null,null,null,null,null,"Please do not fiddle with columns A thru E nor insert more rows."]
{"$rows_left_out":17}
{"sheet":"W8","index":10,"n_rows":24,"n_cols":11,"rows_kept":24,"cut":false,"hidden":false,"merged":[[0,5,0,8],[1,1,1,2],[1,5,1,8],[2,0,2,2]]}
["Date: ",{"$f":"IF(INFO!B19=\"\",\"\",INFO!B19)","v":""},"Week 8",null,"League: ",{"$f":"IF(INFO!C1=\"\",\"\",INFO!C1)","v":""}]
["Course: ",{"$f":"IF(INFO!E19=\"\",\"\",INFO!E19)","v":""},null,null,"Layout: ",{"$f":"IF(INFO!G19=\"\",\"\",INFO!G19)","v":""}]
["** Enter New Players First on UPLOAD page **",null,null,null,{"$f":"COUNTIF(E6:E186,\">0\")","v":0}," = Number who Played",null,null,null,null,"Instructions"]
[null,null,null,"PDGA","Round",null,null,null,"Div",null,"These weekly pages are designed to help you run your league each week."]
["DivCode","First Name","Last Name","or Code","Score","Opt.","Opt.","Opt.","Rank",null,"You may relabel columns F thru I and insert formulas in those columns to"]
[null,null,null,null,null,null,null,null,null,null,"do whatever kind of points, payout or handicap calculations you wish."]
[null,null,null,null,null,null,null,null,null,null,"You may even insert more columns after Column I if you need them."]
[null,null,null,null,null,null,null,null,null,null,"Please do not fiddle with columns A thru E nor insert more rows."]
{"$rows_left_out":17}
{"sheet":"W9","index":11,"n_rows":24,"n_cols":11,"rows_kept":24,"cut":false,"hidden":false,"merged":[[0,5,0,8],[1,1,1,2],[1,5,1,8],[2,0,2,2]]}
["Date: ",{"$f":"IF(INFO!B20=\"\",\"\",INFO!B20)","v":""},"Week 9",null,"League: ",{"$f":"IF(INFO!C1=\"\",\"\",INFO!C1)","v":""}]
["Course: ",{"$f":"IF(INFO!E20=\"\",\"\",INFO!E20)","v":""},null,null,"Layout: ",{"$f":"IF(INFO!G20=\"\",\"\",INFO!G20)","v":""}]
["** Enter New Players First on UPLOAD page **",null,null,null,{"$f":"COUNTIF(E6:E186,\">0\")","v":0}," = Number who Played",null,null,null,null,"Instructions"]
[null,null,null,"PDGA","Round",null,null,null,"Div",null,"These weekly pages are designed to help you run your league each week."]
["DivCode","First Name","Last Name","or Code","Score","Opt.","Opt.","Opt.","Rank",null,"You may relabel columns F thru I and insert formulas in those columns to"]
[null,null,null,null,null,null,null,null,null,null,"do whatever kind of points, payout or handicap calculations you wish."]
[null,null,null,null,null,null,null,null,null,null,"You may even insert more columns after Column I if you need them."]
[null,null,null,null,null,null,null,null,null,null,"Please do not fiddle with columns A thru E nor insert more rows."]
{"$rows_left_out":17}
{"sheet":"W10","index":12,"n_rows":24,"n_cols":11,"rows_kept":24,"cut":false,"hidden":false,"merged":[[0,5,0,8],[1,1,1,2],[1,5,1,8],[2,0,2,2]]}
["Date: ",{"$f":"IF(INFO!B21=\"\",\"\",INFO!B21)","v":""},"Week 10",null,"League: ",{"$f":"IF(INFO!C1=\"\",\"\",INFO!C1)","v":""}]
["Course: ",{"$f":"IF(INFO!E21=\"\",\"\",INFO!E21)","v":""},null,null,"Layout: ",{"$f":"IF(INFO!G21=\"\",\"\",INFO!G21)","v":""}]
["** Enter New Players First on UPLOAD page **",null,null,null,{"$f":"COUNTIF(E6:E186,\">0\")","v":0}," = Number who Played",null,null,null,null,"Instructions"]
[null,null,null,"PDGA","Round",null,null,null,"Div",null,"These weekly pages are designed to help you run your league each week."]
["DivCode","First Name","Last Name","or Code","Score","Opt.","Opt.","Opt.","Rank",null,"You may relabel columns F thru I and insert formulas in those columns to"]
[null,null,null,null,null,null,null,null,null,null,"do whatever kind of points, payout or handicap calculations you wish."]
[null,null,null,null,null,null,null,null,null,null,"You may even insert more columns after Column I if you need them."]
[null,null,null,null,null,null,null,null,null,null,"Please do not fiddle with columns A thru E nor insert more rows."]
{"$rows_left_out":17}
{"sheet":"SUBMIT REPORT","index":13,"n_rows":42,"n_cols":12,"rows_kept":42,"cut":false,"hidden":false,"merged":[[0,0,1,12],[28,2,28,11],[14,5,14,9]]}
["League Report - Submission Checklist"]
[]
[null,null,"INFO tab - Enter all information in yellow boxes known before league starts"]
[null,null,"INFO tab - Update Course or layout info if it changes while league is underway"]
[null,null,"INFO tab - Update Notes regarding bad weather in weeks where it applies"]
[null,null,"INFO tab - Update any additional info at the end of league"]
[null,null,"W 1 thru W 10 tabs - Enter information each week and upload to that weekly page on PDGA site"]
[null,null,"Payout Calc tab - provided as optional help to calculate your payouts if needed"]
{"$rows_left_out":35}
{"sheet":"SUMMARY","index":14,"n_rows":4,"n_cols":38,"rows_kept":4,"cut":false,"hidden":false,"merged":[[2,32,2,34],[2,5,2,7],[2,8,2,10],[2,23,2,25],[0,2,0,16],[0,23,0,25],[2,26,2,28],[2,29,2,31],[2,11,2,13],[2,14,2,16],[2,17,2,19],[2,20,2,22]]}
["League Name:",null,{"$f":"IF(INFO!C1=\"\",\"\",INFO!C1)","v":""},null,null,null,null,null,null,null,null,null,null,null,null,null,null,null,null,null,null,null,"Start Date: ",{"$f":"IF(INFO!S2=\"\",\"\",INFO!S2)","v":""},null,null,null,null,null,null,null,"No. of Weeks:",{"$f":"IF(INFO!S1=\"\",\"\",INFO!S1)","v":""}]
["This page is strictly for the League Dierctor to modify as desired to help track league info. No info on this page is used by the PDGA."]
[null,null,null,null,"Division","Week 1",null,null,"Week 2",null,null,"Week 3",null,null,"Week 4",null,null,"Week 5",null,null,"Week 6",null,null,"Week 7",null,null,"Week 8",null,null,"Week 9",null,null,"Week 10"]
["DivCode","First Name","Last Name","PDGA","Rank","Scr","?","Rnk","Scr","?","Rnk","Scr","?","Rnk","Scr","?","Rnk","Scr","?","Rnk","Scr","?","Rnk","Scr","?","Rnk","Scr","?","Rnk","Scr","?","Rnk","Scr","?","Rnk","Points","Opt.","Opt."]

{"sheet":"Payout Calc","index":15,"n_rows":402,"n_cols":47,"rows_kept":402,"cut":false,"hidden":false,"merged":[[7,0,7,5],[3,5,4,5],[0,0,0,5]]}
["PDGA PAYOUT CALCULATOR",null,null,null,null,null,"Field","# paid",null,null," Number of Places Paid",null,null,null,null,null,null,null,null,null,null,null,null,null,null,null,null,null," Number of Places Paid"]
[null,null,null,null,null,null,null,40,45,50,null,1,2,3,4,5,6,7,8,9,10,11,12,13,14,15,16,17,18,19,20,21,22,23,24,25,26,27,28,29,30,31,32,33]
[null,null," < Enter Field Size",null,null,null,1,1,1,1,1,1,0.625,0.47499999999999998,0.41,0.36,0.33,0.3,0.28000000000000003,0.26800000000000002,0.26,0.25,0.23799999999999999,0.23200000000000001,0.22500000000000001,0.22,0.21,0.2,0.19,0.18,0.16500000000000001,0.152,0.14499999999999999,0.14199999999999999,0.14000000000000001,0.13700000000000001,0.13200000000000001,0.13,0.127,0.125,0.122,0.11799999999999999,0.115,0.112,"1st","P"]
[null,null," < Enter Base Entry Fee",null,null,"Places Paid",2,1,1,1,2,"·········",0.375,0.3,0.26,0.245,0.23,0.21,0.19,0.185,0.18,0.16500000000000001,0.16,0.155,0.15,0.14499999999999999,0.14000000000000001,0.13500000000000001,0.13,0.125,0.11799999999999999,0.115,0.112,0.11,0.107,0.105,0.1,9.8000000000000004E-2,9.5000000000000001E-2,9.2999999999999999E-2,0.09,8.6999999999999994E-2,8.5000000000000006E-2,8.2000000000000003E-2,"2nd","L"]
[null,{"$f":"A3*A4","v":0}," < Enter Added Cash",null,null,null,3,1,1,2,3,"3rd","·········",0.22500000000000001,0.19,0.17,0.155,0.15,0.14499999999999999,0.14000000000000001,0.13,0.127,0.12,0.115,0.11,0.105,0.1,9.7000000000000003E-2,9.5000000000000001E-2,9.1999999999999998E-2,8.8999999999999996E-2,8.6999999999999994E-2,8.5000000000000006E-2,8.4000000000000005E-2,8.2000000000000003E-2,7.8E-2,7.5999999999999998E-2,7.4999999999999997E-2,7.2999999999999995E-2,7.0999999999999994E-2,6.8000000000000005E-2,6.5000000000000002E-2,6.3E-2,5.8000000000000003E-2,"3rd","A"]
[{"$f":"A3*A4+A5","v":0},null," < Net Purse",null,null,{"$f":"IF(A3=\"\",0,VLOOKUP(A3,PaypctP,B7,FALSE))","v":0},4,2,2,2,4,null,"4th","·········",0.14000000000000001,0.125,0.12,0.11,0.115,0.11,0.1,9.8000000000000004E-2,9.5000000000000001E-2,0.09,8.5000000000000006E-2,8.4000000000000005E-2,8.3000000000000004E-2,8.1000000000000003E-2,0.08,7.8E-2,7.5999999999999998E-2,7.4999999999999997E-2,7.1999999999999995E-2,7.0999999999999994E-2,6.6000000000000003E-2,6.5000000000000002E-2,6.4000000000000001E-2,6.3E-2,6.0999999999999999E-2,5.8999999999999997E-2,5.6000000000000001E-2,5.5E-2,5.2999999999999999E-2,5.1999999999999998E-2,"4th","C"]
[null,{"$f":"IF(F7=45%,3,IF(F7=50%,4,2))","v":2},null,"Choose Payout Pct > ",null,0.4,5,2,2,3,5,"P",null,"5th","·········",0.1,9.5000000000000001E-2,9.5000000000000001E-2,0.09,8.5000000000000006E-2,8.1000000000000003E-2,0.08,7.6999999999999999E-2,7.4999999999999997E-2,7.0999999999999994E-2,6.9000000000000006E-2,6.8000000000000005E-2,6.7000000000000004E-2,6.5000000000000002E-2,6.5000000000000002E-2,6.4000000000000001E-2,6.3E-2,6.0999999999999999E-2,0.06,5.7000000000000002E-2,5.6000000000000001E-2,5.5E-2,5.3999999999999999E-2,5.1999999999999998E-2,0.05,4.9000000000000002E-2,4.8000000000000001E-2,4.8000000000000001E-2,4.8000000000000001E-2,"5th","E","< Choose Payout Pct"]
["Based on the steeper PDGA pro table",null,null,null,null,null,6,2,3,3,6,null,"L",null,"6th","·········",7.0000000000000007E-2,7.4999999999999997E-2,7.0000000000000007E-2,6.7000000000000004E-2,6.7000000000000004E-2,6.5000000000000002E-2,6.4000000000000001E-2,6.0999999999999999E-2,0.06,5.8000000000000003E-2,5.7000000000000002E-2,5.6000000000000001E-2,5.5E-2,5.5E-2,5.3999999999999999E-2,5.3999999999999999E-2,5.2999999999999999E-2,5.1999999999999998E-2,5.0999999999999997E-2,4.9000000000000002E-2,4.8000000000000001E-2,4.7E-2,4.5999999999999999E-2,4.4999999999999998E-2,4.4999999999999998E-2,4.4999999999999998E-2,4.4999999999999998E-2,4.4999999999999998E-2,"6th"]
{"$rows_left_out":395}
{"sheet":"Memberships","index":16,"n_rows":0,"n_cols":0,"rows_kept":0,"cut":false,"hidden":false,"merged":[]}

{"sheet":"SupportData","index":17,"n_rows":58,"n_cols":1,"rows_kept":58,"cut":false,"hidden":true,"merged":[]}
["This worksheet contains data used by other worksheets and formulas in this file."]
["Please do not delete this worksheet or modify any data on it."]
[]
["Divcode"]
["MPO"]
["MP40"]
["MP50"]
["MP55"]
{"$rows_left_out":50}