{"text_format":"1","workbook":"xlsx","n_sheets":12,"sheets":["Instructions","Checklist","Cover","Event Info","Scores","Pro.Payouts","Am.Jr.Payouts","Finance","$10 Fees","Memberships","Evaluation","SupportData"],"not_rendered":{"charts":0,"images":2,"macros":1,"external_links":3,"defined_names":90,"comments":3,"pivot_tables":0},"unopened":[],"bounds":{"document_bytes":16777216,"sheet_cells":100000,"rows_first":2000,"rows_last":500,"rows_between":2000,"halvings":0,"cell_chars":16384,"cell_head_chars":4096},"cells_cut":0,"cells_raw":0,"read":"whole","date_system":"1900"}

{"sheet":"Instructions","index":0,"n_rows":91,"n_cols":3,"rows_kept":91,"cut":false,"hidden":false,"merged":[[30,2,35,2],[62,2,64,2],[5,2,9,2],[12,2,17,2],[19,2,22,2],[37,2,49,2]]}
[]
[null,null,"Guide to the PDGA Tour Event Report - Canada Version - Excel"]
[null,null,{"$f":"CONCATENATE(\"Version \",Cover!A1)","v":"Version 18.4c"}]
[null,null,"Dear PDGA Tournament Director,"]
[]
[null,null,"Thank you for directing a PDGA Tour Event! The TD report serves as key input to the PDGA's information system. All TDs use this spreadsheet and return their completed event report to the PDGA office by email as soon as possible. This will speed the processing of your event including the posting of official results at www.pdga.com, and the calculation of player statistics including points, pro cash won and player ratings. The Checklist tab has been added to help you check off each important report item when you complete it and sign your report when it's ready to submit to the PDGA."]
[]
[]
{"$rows_left_out":84}
{"sheet":"Checklist","index":1,"n_rows":46,"n_cols":8,"rows_kept":46,"cut":false,"hidden":false,"merged":[[46,0,46,9],[47,0,47,9],[48,0,48,9],[49,0,49,9],[0,7,1,9],[6,7,6,9],[7,7,7,9],[40,0,40,9],[41,0,41,9],[2,7,5,9],[9,8,9,9],[12,7,27,9],[28,7,29,8],[38,0,38,9],[39,0,39,9]]}
["EXCEL",null,null,null,null,null,null," TD Signature"]
["PAGE TAB",null,"Enter  Y  in each box when you have completed each item"]
["   v v v v",null,"v v v",null,"   Clicking on each line item below jumps to initial tab cell",null,null,"I hereby certify that the        information I have provided in this report is accurate to the best of my ability and knowledge."]
["Cover",null,null,null,"Enter Tournament Name, TD Name, Email, PDGA#, City, Province"]
[null,null,null,null,"Enter Dates and Event Tier"]
[null,null,null,null,"Enter Gross Entry Fees and Other Fees for each Division playing"]
[]
["Event Info",null,null,null,"Enter Course Name as listed in PDGA Course Directory"]
{"$rows_left_out":39}
{"sheet":"Cover","index":2,"n_rows":61,"n_cols":26,"rows_kept":61,"cut":false,"hidden":false,"merged":[[2,25,2,27],[3,25,3,27],[23,7,23,12],[22,14,22,19],[10,25,10,27],[12,25,12,27],[13,25,13,27],[9,15,9,19],[4,25,4,27],[1,8,1,19],[14,15,14,19],[3,7,3,12],[3,15,3,16],[5,14,5,17],[3,18,3,19],[8,15,8,19],[31,14,31,19],[6,16,6,18],[5,25,5,27],[7,25,7,27],[8,25,8,27],[9,25,9,27],[6,25,6,27],[11,25,11,27]]}
["18.4c"]
["            Canada Tour Event Report",null,null,null,null,null,null,"Event: "]
[null,"Enter fees 'per player' in the yellow boxes. Green boxes are protected cells and only filled automatically.",null,null,null,null,null,null,null,null,null,null,null,null,null,null,null,null,null,null,null,null,null,null,null,"NOTE"]
[null,"Note new options for Other Fees",null,null,null,null,null,"Trophy Only - Ams pay entry discount",null,null,null,null,null,null,"Date(s): ",null,null,"to",null,null,null,null,null,null,null,"Type only in white"]
[null,"Gross","PDGA","Other","Net","# of","Total Net","Gross","PDGA","Other","Net","# of","Total Net",null,null,null,null,null,null,null,null,null,null,"Gross",null,"or yellow boxes"]
["PROS","Entry","Fee","Fees","Entry","Plyrs","Entry Fees","Entry","Fee","Fees","Entry","Plyrs","Entry Fees",null,{"$f":"IF(COUNTIF(C7:M54,#N/A)>0,\"ENTER TIER LEVEL!\",\"\")","v":""},null,null,null,null,null,null,null,null,"Entry Fees",null,"DO NOT TYPE IN"]
["Open",null,{"$f":"IF(AND(tier1<>\"\",F7>0),VLOOKUP(tier1,tierDB,3,FALSE),0)","v":0},null,{"$f":"B7-C7-D7","v":0},{"$f":"COUNTIF(Division,\"MPO\")-L7","v":0},{"$f":"F7*E7","v":0},null,{"$f":"IF(AND(tier1<>\"\",L7>0),VLOOKUP(tier1,tierDB,3,FALSE),0)","v":0},null,{"$f":"H7-I7-J7","v":0},{"$f":"COUNTIF(Scores!O$10:O$500,\"MPOY\")","v":0},{"$f":"L7*K7","v":0},null,null,"Tier: ","B Pro / C Am",null,null,null,null,null,"Pro",{"$f":"SUM(B7:B22*F7:F22)","v":0},null,"BLUE OR"]
["Master MP40",null,0,null,0,{"$f":"COUNTIF(Division,\"MP40\")-L8","v":0},{"$f":"F8*E8","v":0},null,0,null,0,{"$f":"COUNTIF(Scores!O$10:O$500,\"MPMY\")","v":0},0,null,null,null,null,null,null,null,null,null,"Am",{"$f":"SUM(B25:B44*F25:F44)","v":0},null,"GREEN BOXES!"]
{"$rows_left_out":54}
{"sheet":"Event Info","index":3,"n_rows":110,"n_cols":18,"rows_kept":110,"cut":false,"hidden":false,"merged":[[93,1,93,3],[94,1,94,3],[111,1,111,15],[112,1,112,15],[101,1,101,3],[102,1,102,3],[103,1,103,3],[110,1,110,15],[95,1,95,3],[96,1,96,3],[97,1,97,3],[98,1,98,3],[86,1,86,15],[92,4,92,5],[92,6,92,7],[92,14,92,15],[29,0,44,0],[30,1,30,3],[36,1,36,3],[32,1,32,3],[29,1,29,3],[31,1,31,3],[87,1,87,15],[88,1,88,15],[67,0,78,0],[45,1,45,3],[46,1,46,3],[47,1,47,3],[21,17,21,19],[10,17,10,19],[11,17,11,19],[12,17,12,19],[13,17,13,19],[14,17,14,19],[18,17,18,19],[19,17,19,19],[15,17,15,19],[16,17,16,19],[20,17,20,19],[17,17,17,19],[49,1,49,3],[51,1,51,3],[67,1,67,3],[68,1,68,3],[53,1,53,3],[62,1,62,3],[57,1,57,3],[58,1,58,3],[45,0,64,0],[52,1,52,3],[17,11,17,13],[20,11,20,13],[21,11,21,13],[18,11,18,13],[34,1,34,3],[35,1,35,3],[38,1,38,3],[39,1,39,3],[40,1,40,3],[41,1,41,3],[55,1,55,3],[56,1,56,3],[59,1,59,3],[60,1,60,3],[14,11,14,13],[15,11,15,13],[16,11,16,13],[19,11,19,13],[12,11,12,13],[13,11,13,13],[8,11,8,13],[9,11,9,13],[10,11,10,13],[11,11,11,13],[64,1,64,3],[63,1,63,3],[8,5,8,9],[33,1,33,3],[54,1,54,3],[48,1,48,3],[50,1,50,3],[61,1,61,3],[37,1,37,3],[44,1,44,3],[43,1,43,3],[42,1,42,3],[69,1,69,3],[77,1,77,3],[78,1,78,3],[70,1,70,3],[73,1,73,3],[74,1,74,3],[75,1,75,3],[71,1,71,3],[72,1,72,3],[76,1,76,3]]}
[" PDGA Canada Tour Event Report: General Information"]
[]
["1.","Course Layouts",null,"Link to PDGA Course Directory >",null,"www.pdga.com/course-directory"]
[]
[null,"It is important you complete the following information accurately so your players get correct ratings."]
[null,"If you have any questions, please contact the PDGA office: ",null,null,null,"tourmgr@pdga.com"]
[null,"Please remove any apostrophes in course names or words even if it's that way in the directory!"]
[]
{"$rows_left_out":103}
{"sheet":"Scores","index":4,"n_rows":500,"n_cols":30,"rows_kept":500,"cut":false,"hidden":false,"merged":[[6,28,6,30],[42,17,42,19],[0,3,0,8],[2,17,4,27],[38,20,38,22],[5,17,5,27],[37,20,37,22],[0,11,0,13],[42,20,42,22],[6,25,6,27],[43,20,43,22],[0,17,0,23],[40,17,40,19],[40,20,40,22],[41,17,41,19],[41,20,41,22],[37,17,38,19],[39,17,39,19],[39,20,39,22]]}
["Tour Event Name:",null,null,{"$f":"IF(Cover!I2=\"\",\"\",Cover!I2)","v":""},null,null,null,null,null,null,"Dates:",{"$f":"IF(Cover!P4=\"\",\"\",Cover!P4)","v":""},null,null,null,null,null,"NOTE ON DNF (Did Not Finish) CODES"]
[]
["Please enter the player Division Codes, Names and PDGA#s on this page before",null,null,null,null,null,null,null,null,null,null,null,null,null,null,null,null,"Enter 888 when a player has not notified the TD they will not be playing the next scheduled round. Enter 888 when a player has been confirmed to have manipulated their score or dropped out to preserve their rating. For all other cases where a player was not able to finish the round, enter 999."]
["completing the COVER page and using the PAYOUT worksheets. Do not include",null,null,null,null,null,null,null,null,null,null,null,null," Use Special Sort button above when"]
["players who registered but did not show up or make a throw in the tournament.",null,null,null,null,null,null,null,null,null,null,null,null,"your Event has Semi or Final round.",null,"Total US$"]
["Click button to upload scores",null,null,null,null,null,null,"Use Basic Sort button after Rd1 thru  >",null,null,null,null,null,"You MUST enter Final rankings in Place",null,{"$f":"SUM(P10:P510)","v":0},null,"  Division Codes: Use the following 3 or 4 character codes in the DivCode field."]
[null,null,null,null,null,null,null,"Rd4. Use Special Sort if Final round.    ",null,null,null,null,null,"column for players in Semi/Final.",null,null,null,"PROFESSIONAL DIVISIONS",null,null,null,"AMATEUR DIVISIONS",null,null,null,"RATINGS DIVISIONS",null,null,"JUNIOR DIVISIONS"]
[null,null,null,null,null,null,null,null,null,null,null,null,"Canadian","Am Cash",null,"Conv to",null,"MPO","Open",null,null,"MA1","Advanced",null,null,"Code","Color","Rating","MJ18","Junior Boys < 18"]
{"$rows_left_out":493}
{"sheet":"Pro.Payouts","index":5,"n_rows":103,"n_cols":60,"rows_kept":103,"cut":false,"hidden":false,"merged":[[84,0,84,5],[84,7,84,12],[84,14,84,19],[51,14,51,19],[20,14,20,19],[73,14,73,19],[73,0,73,5],[73,7,73,12],[72,7,72,12],[72,14,72,19],[72,0,72,5],[66,14,66,19],[0,0,0,5],[0,7,0,12],[0,14,0,19],[30,0,30,5],[30,7,30,12],[20,7,20,12],[30,14,30,19],[20,0,20,5]]}
["WOMEN PRO DIVISION",null,null,null,null,null,null,"WOMEN MASTER PRO 40+",null,null,null,null,null,null,"WOMEN MASTER PRO 50+",null,null,null,null,null,null,"Field","# paid"]
[null,null,null,null,"Enter Added Cash (or deduction) here* > ",null,null,null,null,null,null,"Enter Added Cash (or deduction) here* > ",null,null,null,null,null,null,"Enter Added Cash (or deduction) here* > ",0,null,null,40,45,50]
["# Paid",null,"Field Size",null,"Total Fees: ",{"$f":"Cover!G16","v":0},null,"# Paid",null,"Field Size",null,"Total Fees: ",{"$f":"Cover!G17","v":0},null,"# Paid",null,"Field Size",null,"Total Fees: ",{"$f":"Cover!G18","v":0},null,1,1,1,1,null,"Number of Places Paid"]
[{"$f":"VLOOKUP(C4,paypct,B5,FALSE)","v":{"$error":"#N/A"}},null,{"$f":"IF(Cover!F16=0,91,Cover!F16)","v":91},null,"Net Purse: ",{"$f":"F3+F2","v":0},null,{"$f":"VLOOKUP(J4,paypct,I5,FALSE)","v":{"$error":"#N/A"}},null,{"$f":"IF(Cover!F17=0,91,Cover!F17)","v":91},null,"Net Purse: ",{"$f":"M3+M2","v":0},null,{"$f":"VLOOKUP(Q4,paypct,P5,FALSE)","v":{"$error":"#N/A"}},null,{"$f":"IF(Cover!F18=0,91,Cover!F18)","v":91},null,"Net Purse: ",{"$f":"T3+T2","v":0},null,2,1,1,1,null,1,2,3,4,5,6,7,8,9,10,11,12,13,14,15,16,17,18,19,20,21,22,23,24,25,26,27,28,29,30,31,32,33]
[null,{"$f":"IF(E5=45%,3,IF(E5=50%,4,2))","v":2},null,"Choose Payout Percentage>",0.4,null,null,null,{"$f":"IF(L5=45%,3,IF(L5=50%,4,2))","v":2},null,"Choose Payout Percentage>",0.4,null,null,null,{"$f":"IF(S5=45%,3,IF(S5=50%,4,2))","v":2},null,"Choose Payout Percentage>",0.4,null,null,3,1,1,2,1,1,0.625,0.47499999999999998,0.41,0.36,0.33,0.3,0.28000000000000003,0.26800000000000002,0.26,0.25,0.23799999999999999,0.23200000000000001,0.22500000000000001,0.22,0.21,0.2,0.19,0.18,0.16500000000000001,0.152,0.14499999999999999,0.14199999999999999,0.14000000000000001,0.13700000000000001,0.13200000000000001,0.13,0.127,0.125,0.122,0.11799999999999999,0.115,0.112,1]
[null,"Prelim","Proposed","Round","Manual","Final",null,null,"Prelim","Proposed","Round","Manual","Final",null,null,"Prelim","Proposed","Round","Manual","Final",null,4,2,2,2,2,"·········",0.375,0.3,0.26,0.245,0.23,0.21,0.19,0.185,0.18,0.16500000000000001,0.16,0.155,0.15,0.14499999999999999,0.14000000000000001,0.13500000000000001,0.13,0.125,0.11799999999999999,0.115,0.112,0.11,0.107,0.105,0.1,9.8000000000000004E-2,9.5000000000000001E-2,9.2999999999999999E-2,0.09,8.6999999999999994E-2,8.5000000000000006E-2,8.2000000000000003E-2,2]
["Place","Factor","Payout $$","to $5","Adj. ","Place",null,"Place","Factor","Payout $$","to $5","Adj. ","Place",null,"Place","Factor","Payout $$","to $5","Adj. ","Place",null,5,2,2,3,3,"3rd","·········",0.22500000000000001,0.19,0.17,0.155,0.15,0.14499999999999999,0.14000000000000001,0.13,0.127,0.12,0.115,0.11,0.105,0.1,9.7000000000000003E-2,9.5000000000000001E-2,9.1999999999999998E-2,8.8999999999999996E-2,8.6999999999999994E-2,8.5000000000000006E-2,8.4000000000000005E-2,8.2000000000000003E-2,7.8E-2,7.5999999999999998E-2,7.4999999999999997E-2,7.2999999999999995E-2,7.0999999999999994E-2,6.8000000000000005E-2,6.5000000000000002E-2,6.3E-2,5.8000000000000003E-2,3]
[{"$f":"IF(ROW()-7>$A$4,\"\",ROW()-7)","v":{"$error":"#N/A"}},{"$f":"IF(A8=\"\",\"\",VLOOKUP(A8,_pay1,$A$4+1))","v":{"$error":"#N/A"}},{"$f":"IF(B8=\"\",\"\",$F$4*B8)","v":{"$error":"#N/A"}},{"$f":"IF(C8=\"\",\"\",INT((C8+2.5)/5)*5)","v":{"$error":"#N/A"}},null,null,null,{"$f":"IF(ROW()-7>$H$4,\"\",ROW()-7)","v":{"$error":"#N/A"}},{"$f":"IF(H8=\"\",\"\",VLOOKUP(H8,_pay1,$H$4+1))","v":{"$error":"#N/A"}},{"$f":"IF(I8=\"\",\"\",$M$4*I8)","v":{"$error":"#N/A"}},{"$f":"IF(J8=\"\",\"\",INT((J8+2.5)/5)*5)","v":{"$error":"#N/A"}},null,null,null,{"$f":"IF(ROW()-7>$O$4,\"\",ROW()-7)","v":{"$error":"#N/A"}},{"$f":"IF(O8=\"\",\"\",VLOOKUP(O8,_pay1,$O$4+1))","v":{"$error":"#N/A"}},{"$f":"IF(P8=\"\",\"\",$T$4*P8)","v":{"$error":"#N/A"}},{"$f":"IF(Q8=\"\",\"\",INT((Q8+2.5)/5)*5)","v":{"$error":"#N/A"}},null,null,null,6,2,3,3,4,null,"4th","·········",0.14000000000000001,0.125,0.12,0.11,0.115,0.11,0.1,9.8000000000000004E-2,9.5000000000000001E-2,0.09,8.5000000000000006E-2,8.4000000000000005E-2,8.3000000000000004E-2,8.1000000000000003E-2,0.08,7.8E-2,7.5999999999999998E-2,7.4999999999999997E-2,7.1999999999999995E-2,7.0999999999999994E-2,6.6000000000000003E-2,6.5000000000000002E-2,6.4000000000000001E-2,6.3E-2,6.0999999999999999E-2,5.8999999999999997E-2,5.6000000000000001E-2,5.5E-2,5.2999999999999999E-2,5.1999999999999998E-2,4]
{"$rows_left_out":96}
{"sheet":"Am.Jr.Payouts","index":6,"n_rows":218,"n_cols":61,"rows_kept":218,"cut":false,"hidden":false,"merged":[[0,0,0,5],[0,7,0,12],[0,14,0,19],[22,7,22,12],[22,14,22,19],[21,14,21,19],[21,7,21,12],[41,0,41,5],[107,14,107,19],[108,7,108,12],[108,14,108,19],[68,7,68,12],[107,7,107,12],[65,14,65,19],[84,0,84,5],[43,7,43,12],[43,14,43,19],[69,7,69,12],[86,0,86,5],[43,0,43,5],[56,7,56,12],[86,7,86,12],[86,14,86,19],[148,0,148,5],[128,0,128,5],[148,7,148,12],[128,7,128,12],[147,0,147,5],[158,7,158,12],[147,14,147,19],[148,14,148,19],[159,7,159,12],[128,14,128,19],[199,0,199,5],[199,7,199,12],[199,14,199,19],[167,14,167,19],[179,0,179,5],[179,7,179,12],[179,14,179,19],[167,0,167,5],[169,7,169,12]]}
["ADVANCED DIVISION",null,null,null,null,null,null,"MASTER AM 40+",null,null,null,null,null,null,"ADVANCED WOMEN DIVISION",null,null,null,null,null,null,null,null,null,null,null,null,null,null,null,null,null,null,null,null,null,null,null,null,null,null,null,null,null,null,null,null,null,null,null,null,null,null,null,null,null,0.5,null,null,0.45]
[null,null,null,null,"Enter Added Cash (or deduction) here* > ",0,null,null,null,null,null,"Enter Added Cash (or deduction) here* > ",0,null,null,null,null,null,"Enter Added Cash (or deduction) here* > ",0,null,null,null,null,null,null,null,null,null,null,null,null,null,null,null,null,null,null,null,null,null,null,null,null,null,null,null,null,null,null,null,null,null,null,null,null,"Field","# paid",null,"Field","# paid"]
["# Paid",null,"Field Size","Pay pct","Total Fees: ",{"$f":"Cover!G25+Cover!M25","v":0},null,"# Paid",null,"Field Size","Pay pct","Total Fees: ",{"$f":"Cover!G29+Cover!M29","v":0},null,"# Paid",null,"Field Size","Pay pct","Total Fees: ",{"$f":"Cover!G35","v":0}]
[{"$f":"IF(D4=45%,VLOOKUP(C4,dbd,2,FALSE),VLOOKUP(C4,dbe,2,FALSE))","v":{"$error":"#N/A"}},null,{"$f":"IF(Cover!F25=0,91,Cover!F25+ROUNDDOWN(Cover!L25/3,0))","v":91},0.45,"Net Purse: ",{"$f":"F3+F2","v":0},null,{"$f":"IF(K4=45%,VLOOKUP(J4,dbd,2,FALSE),VLOOKUP(J4,dbe,2,FALSE))","v":{"$error":"#N/A"}},null,{"$f":"IF(Cover!F29=0,91,Cover!F29+ROUNDDOWN(Cover!L29/3,0))","v":91},0.45,"Net Purse: ",{"$f":"M3+M2","v":0},null,{"$f":"IF(R4=45%,VLOOKUP(Q4,dbd,2,FALSE),VLOOKUP(Q4,dbe,2,FALSE))","v":{"$error":"#N/A"}},null,{"$f":"IF(Cover!F35=0,91,Cover!F35)","v":91},0.45,"Net Purse: ",{"$f":"T3+T2","v":0},null,null,null,null,null,null,null,null,null,null,null,null,null,null,null,null,null,null,null,null,null,null,null,null,null,null,null,null,null,null,null,null,null,null,null,null,1,1,null,1,1]
[null,null,null,{"$f":"IF(C4=91,\"       To use this table, enter player divisions on Scores page\",IF(C4>75,\"Field limit exceeded. Use printed Payout tables.\",\"\"))","v":"       To use this table, enter player divisions on Scores page"},null,null,null,null,null,null,{"$f":"IF(J4=91,\"       To use this table, enter player divisions on Scores page\",IF(J4>30,\"Field limit exceeded. Use printed Payout tables.\",\"\"))","v":"       To use this table, enter player divisions on Scores page"},null,null,null,null,null,null,{"$f":"IF(Q4=91,\"       To use this table, enter player divisions on Scores page\",IF(Q4>30,\"Field limit exceeded. Use printed Payout tables.\",\"\"))","v":"       To use this table, enter player divisions on Scores page"},null,null,null,null,null,null,null,null,null,null,null,null,null,null,null,null,null,null,null,null,null,null,null,null,null,null,null,null,null,null,null,null,null,null,null,null,null,null,2,1,null,2,1]
[null,"Prelim","Proposed","Round","Manual","Final",null,null,"Prelim","Proposed","Round","Manual","Final",null,null,"Prelim","Proposed","Round","Manual","Final",null,null,null,null,null,null,null,null,null,null,null,null,null,null,null,null,null,null,null,null,null,null,null,null,null,null,null,null,null,null,null,null,null,null,null,null,3,2,null,3,1]
["Place","Factor","Payout $$","to $5","Adj. ","Place",null,"Place","Factor","Payout $$","to $5","Adj. ","Place",null,"Place","Factor","Payout $$","to $5","Adj. ","Place",null,null,null,null,null,null,null,null,null,null,null,null,null,null,null,null,null,null,null,null,null,null,null,null,null,null,null,null,null,null,null,null,null,null,null,null,4,2,null,4,2]
[{"$f":"IF(ROW()-7>$A$4,\"\",ROW()-7)","v":{"$error":"#N/A"}},{"$f":"IF(A8>$A$4,\"\",IF(D$4=45%,VLOOKUP(A8,__pay5,$A$4+1),VLOOKUP(A8,__pay3,$A$4+1)))","v":{"$error":"#N/A"}},{"$f":"IF(B8=\"\",\"\",$F$4*B8)","v":{"$error":"#N/A"}},{"$f":"IF(C8=\"\",\"\",INT((C8+2.5)/5)*5)","v":{"$error":"#N/A"}},null,null,null,{"$f":"IF(ROW()-7>$H$4,\"\",ROW()-7)","v":{"$error":"#N/A"}},{"$f":"IF(K$4=45%,VLOOKUP(H8,__pay5,$H$4+1),VLOOKUP(H8,__pay3,$H$4+1))","v":{"$error":"#N/A"}},{"$f":"IF(I8=\"\",\"\",$M$4*I8)","v":{"$error":"#N/A"}},{"$f":"IF(J8=\"\",\"\",INT((J8+2.5)/5)*5)","v":{"$error":"#N/A"}},null,null,null,{"$f":"IF(ROW()-7>$O$4,\"\",ROW()-7)","v":{"$error":"#N/A"}},{"$f":"IF(R$4=45%,VLOOKUP(O8,__pay5,$O$4+1),VLOOKUP(O8,__pay3,$O$4+1))","v":{"$error":"#N/A"}},{"$f":"IF(P8=\"\",\"\",$T$4*P8)","v":{"$error":"#N/A"}},{"$f":"IF(Q8=\"\",\"\",INT((Q8+2.5)/5)*5)","v":{"$error":"#N/A"}},null,null,null,null,null,null,null,null,null,null,null,null,null,null,null,null,null,null,null,null,null,null,null,null,null,null,null,null,null,null,null,null,null,null,null,null,null,null,5,3,null,5,2]
{"$rows_left_out":211}
{"sheet":"Finance","index":7,"n_rows":78,"n_cols":20,"rows_kept":78,"cut":false,"hidden":false,"merged":[[77,8,77,13],[70,0,70,4],[69,0,69,4],[71,0,71,4],[76,8,76,13],[74,8,74,13],[73,8,73,13],[76,0,76,4],[74,0,74,4],[73,0,73,4],[72,0,72,4],[69,8,69,13],[72,8,72,13],[71,8,71,13],[70,8,70,13],[52,8,52,13],[57,8,57,13],[56,8,56,13],[50,8,50,13],[23,7,23,9],[34,7,34,9],[32,7,32,9],[48,8,48,13],[26,11,26,13],[27,7,27,9],[29,11,29,13],[54,0,54,4],[56,0,56,4],[55,0,55,4],[18,0,18,2],[21,11,21,13],[23,11,23,13],[24,7,24,9],[18,11,18,13],[22,7,22,9],[19,0,19,2],[20,0,20,2],[30,0,30,2],[30,7,30,9],[25,11,25,13],[30,4,30,5],[22,11,22,13],[28,4,28,5],[25,4,25,5],[24,11,24,13],[27,11,27,13],[25,7,25,9],[26,7,26,9],[18,4,18,5],[21,7,21,9],[2,2,2,4],[4,0,4,2],[9,4,9,5],[11,4,11,5],[8,7,8,9],[8,4,8,5],[51,8,51,13],[53,0,53,4],[52,0,52,4],[4,7,4,9],[4,11,4,14],[7,11,7,13],[6,11,6,13],[7,7,7,9],[19,7,19,9],[20,7,20,9],[19,4,19,5],[20,11,20,13],[19,11,19,13],[20,4,20,5],[7,0,7,2],[7,4,7,5],[16,11,16,13],[17,11,17,13],[68,8,68,13],[66,8,66,13],[67,0,67,4],[66,0,66,4],[57,0,57,4],[67,8,67,13],[64,0,64,4],[63,0,63,4],[63,8,63,13],[62,8,62,13],[58,8,58,13],[61,8,61,13],[59,8,59,13],[61,0,61,4],[60,8,60,13],[58,0,58,4],[59,0,59,4],[65,8,65,13],[65,0,65,4],[62,0,62,4],[68,0,68,4],[60,0,60,4],[64,8,64,13],[8,11,8,13],[17,4,17,5],[14,4,14,5],[9,7,9,9],[6,4,6,5],[17,0,17,2],[12,4,12,5],[13,4,13,5],[6,0,6,2],[10,4,10,5],[9,0,9,2],[8,0,8,2],[15,7,15,9],[15,0,15,2],[16,0,16,2],[6,7,6,9],[9,11,9,13],[15,11,15,13],[17,7,17,9],[16,7,16,9],[15,4,15,5],[16,4,16,5],[18,7,18,9],[28,11,28,13],[28,7,28,9],[24,4,24,5],[23,4,23,5],[26,4,26,5],[27,4,27,5],[22,4,22,5],[21,4,21,5],[35,4,35,5],[32,11,32,13],[29,7,29,9],[34,4,34,5],[29,4,29,5],[30,11,30,13],[31,11,31,13],[33,7,33,9],[33,11,33,13],[31,7,31,9],[49,0,49,4],[49,8,49,13],[48,0,48,4],[29,0,29,2],[28,0,28,2],[31,4,31,5],[31,0,31,2],[33,4,33,5],[47,8,47,13],[44,8,44,9],[47,0,47,4],[32,4,32,5],[32,0,32,2],[46,0,46,4],[42,0,42,15],[46,8,46,13],[35,7,35,9],[35,11,35,14],[34,11,34,13],[34,0,34,2],[41,0,41,15],[33,0,33,2],[40,0,40,15],[35,0,35,2]]}
[null,null,null,null,null,null,null," PDGA Canada Tour Event: Financial Summary"]
[]
["Part 1:",null,"Sponsors",null,null,null,"Please list all sponsors and their contributions."]
[]
["Cash Sponsors",null,null,null,"Amount",null,null,"Non Cash Sponsors",null,null,null,"Description of Donation",null,null,null,"Value"]
[]
[]
[]
{"$rows_left_out":71}
{"sheet":"$10 Fees","index":8,"n_rows":12,"n_cols":10,"rows_kept":12,"cut":false,"hidden":false,"merged":[[6,0,9,9]]}
["List of Non-Current Players / Supporting Members Paying the $10 PDGA Fee"]
[]
["Instructions: PDGA current membership is required at all Majors, National Tour and SuperTour (A Tier) events. For all other events, non-current or non-member"]
["players may participate by paying a $10 fee to the PDGA in lieu of membership. This fee is required of ALL players who cannot prove current membership, except"]
["for players competing in a Junior division."]
[]
["New players who pay the $10 fee are eligible for a $10 discount when registering as a new member of the PDGA. The discount can only be applied to membership registration received during the same calendar year as the $10 fee.  Players should use the code NONMEMBER10 to receive this discount.  TDs are encouraged to provide PDGA membership forms to any player who is not current."]
[]
{"$rows_left_out":5}
{"sheet":"Memberships","index":9,"n_rows":0,"n_cols":0,"rows_kept":0,"cut":false,"hidden":false,"merged":[]}

{"sheet":"Evaluation","index":10,"n_rows":0,"n_cols":0,"rows_kept":0,"cut":false,"hidden":false,"merged":[]}

{"sheet":"SupportData","index":11,"n_rows":52,"n_cols":7,"rows_kept":52,"cut":false,"hidden":true,"merged":[]}
["This worksheet contains data used by other worksheets and formulas in this file."]
["Please do not delete this worksheet or modify any data on it."]
[]
["Divcode",null,"Tier","Code","Fee","Tier 1","Tier 2"]
["MPO",null,"NT",1,5,"NT"]
["MP40",null,"A or XA",2,4,"A or XA"]
["MP50",null,"B or XB",3,3,"B or XB"]
["MP55",null,"C or XC",4,2,"C or XC"]
{"$rows_left_out":44}