{"text_format":"1","workbook":"xlsx","n_sheets":12,"sheets":["Instructions","Cover","Event Info","Scores","Pro.Payouts","Unified.Payouts","Finance","$10 Fees","Membership Form","Memberships","Evaluation Form","SupportData"],"not_rendered":{"charts":0,"images":3,"macros":1,"external_links":4,"defined_names":69,"comments":3,"pivot_tables":0},"unopened":[],"bounds":{"document_bytes":16777216,"sheet_cells":100000,"rows_first":2000,"rows_last":500,"rows_between":2000,"halvings":0,"cell_chars":16384,"cell_head_chars":4096},"cells_cut":0,"cells_raw":0,"read":"whole","date_system":"1900"}

{"sheet":"Instructions","index":0,"n_rows":95,"n_cols":3,"rows_kept":95,"cut":false,"hidden":false,"merged":[]}
[]
[null,null,"Guide to the PDGA Ratings Based Event Report - Excel"]
[null,null,{"$f":"CONCATENATE(\"Version \",Cover!A1)","v":"Version 17-R1a"}]
[null,null,"Dear PDGA Tournament Director,"]
[]
[null,null,"Thanks for directing a PDGA Ratings based event! The TD report has been updated to MS Excel 2007+"]
[null,null,"and serves as a key component of the PDGA's database system. All TDs are expected to use this "]
[null,null,"tool and to return their completed event report to the PDGA office by email as an attached file as soon"]
[null,null,"as possible. This will speed the processing of your event including the posting of official results at"]
[null,null,"www.pdga.com, and the calculation of player statistics including points, pro cash won and player"]
{"$rows_left_out":86}
{"sheet":"Cover","index":1,"n_rows":49,"n_cols":26,"rows_kept":49,"cut":false,"hidden":false,"merged":[[48,13,48,17],[27,14,27,19],[6,16,6,18],[5,25,5,27],[7,25,7,27],[8,25,8,27],[9,25,9,27],[6,25,6,27],[11,25,11,27],[1,8,1,19],[14,15,14,19],[3,15,3,16],[5,14,5,17],[3,18,3,19],[8,15,8,19],[2,25,2,27],[3,25,3,27],[18,14,18,19],[10,25,10,27],[12,25,12,27],[13,25,13,27],[9,15,9,19],[4,25,4,27]]}
["17-R1a"]
["            Ratings Based Event Report",null,null,null,null,null,null,"Event: "]
[null,"Enter fees 'per player' in the yellow boxes. Green boxes are protected cells and only filled automatically.",null,null,null,null,null,null,null,null,null,null,null,null,null,null,null,null,null,null,null,null,null,null,null,"NOTE"]
[null,"Note new options for Other Fees",null,null,null,null,null,null,null,null,null,null,null,null,"Date(s): ",null,null,"to",null,null,null,null,null,null,null,"Type only in white"]
[null,"Gross","PDGA","Other","Net","# of","Total Net",null,null,null,null,null,null,null,null,null,null,null,null,null,null,null,null,"Gross",null,"or yellow boxes"]
["PROS","Entry","Fee","Fees","Entry","Plyrs","Entry Fees",null,null,null,null,null,null,null,{"$f":"IF(COUNTIF(C7:M46,#N/A)>0,\"ENTER TIER LEVEL!\",\"\")","v":""},null,null,null,null,null,null,null,null,"Entry Fees",null,"DO NOT TYPE IN"]
["GOLD - Open",null,{"$f":"IF(AND(tier1<>\"\",F7>0),VLOOKUP(tier1,tierDB,3,FALSE),0)","v":0},null,{"$f":"B7-C7-D7","v":0},{"$f":"COUNTIF(Division,\"RPA\")","v":0},{"$f":"F7*E7","v":0},null,null,null,null,null,null,null,null,"Tier: ","C / XC",null,null,null,null,null,"Pro",{"$f":"SUM(B7:B18*F7:F18)","v":0},null,"BLUE OR"]
[null,null,null,null,null,null,null,null,null,null,null,null,null,null,null,null,null,null,null,null,null,null,"Unified",{"$f":"SUM(B21:B35*F21:F35)","v":0},null,"GREEN BOXES!"]
[null,null,null,null,null,null,null,null,null,null,null,null,null,null,"TD Name: ",null,null,null,null,null,null,null,null,null,null,"These all use"]
[null,null,null,null,null,null,null,null,null,null,null,null,null,null,"Email Addr: ","@",null,null,null,null,null,null,null,{"$f":"SUM(X7:X9)","v":0},null,"automatic entries"]
{"$rows_left_out":40}
{"sheet":"Event Info","index":2,"n_rows":100,"n_cols":18,"rows_kept":100,"cut":false,"hidden":false,"merged":[[32,0,36,0],[29,0,31,0],[100,1,100,15],[101,1,101,15],[55,1,55,15],[41,1,41,15],[39,1,39,15],[45,4,45,5],[45,6,45,7],[46,1,46,3],[36,1,36,3],[40,1,40,15],[56,1,56,15],[45,14,45,15],[51,1,51,3],[47,1,47,3],[102,1,102,15],[70,1,70,15],[57,1,57,15],[61,1,61,15],[62,1,62,15],[63,1,63,15],[79,1,79,8],[79,10,79,15],[72,1,72,15],[73,1,73,15],[71,1,71,15],[64,1,64,15],[48,1,48,3],[49,1,49,3],[50,1,50,3],[12,11,12,13],[13,11,13,13],[14,11,14,13],[15,11,15,13],[32,1,32,3],[33,1,33,3],[29,1,29,3],[16,11,16,13],[20,11,20,13],[21,11,21,13],[8,5,8,9],[8,11,8,13],[9,11,9,13],[10,11,10,13],[11,11,11,13],[17,17,17,19],[19,11,19,13],[35,1,35,3],[21,17,21,19],[18,17,18,19],[19,17,19,19],[20,17,20,19],[18,11,18,13],[17,11,17,13],[34,1,34,3],[14,17,14,19],[15,17,15,19],[16,17,16,19],[10,17,10,19],[11,17,11,19],[12,17,12,19],[13,17,13,19]]}
[" PDGA Tour Event Report: General Information"]
[]
["1.","Course Layouts",null,"Link to PDGA Course Directory >",null,"www.pdga.com/course-directory"]
[]
[null,"It is important you complete the following information accurately so your players get correct ratings."]
[null,"If you have any questions, please contact the PDGA office: ",null,null,null,"tdreport@pdga.com"]
[null,"Please remove any apostrophes in course names or words even if it's that way in the directory!"]
[]
["Layout",null,null,null,null,"Number of Holes",null,null,null,null,null,"Length",null,null,null,"Meas."]
["Code","Park or Course Name",null," Specific Layout / Configuration Name",null,"Perm",null,"Temp",null,"TOT",null,"(feet)",null,null,null,"or Est?"]
{"$rows_left_out":91}
{"sheet":"Scores","index":3,"n_rows":500,"n_cols":20,"rows_kept":500,"cut":false,"hidden":false,"merged":[[39,19,39,21],[0,16,0,22],[36,16,36,18],[36,19,36,21],[37,16,37,18],[37,19,37,21],[33,16,34,18],[35,16,35,18],[35,19,35,21],[38,16,38,18],[38,19,38,21],[0,3,0,8],[2,16,4,26],[34,19,34,21],[6,16,6,26],[33,19,33,21],[0,11,0,13]]}
["Tour Event Name:",null,null,{"$f":"IF(Cover!I2=\"\",\"\",Cover!I2)","v":""},null,null,null,null,null,null,"Dates:",{"$f":"IF(Cover!P4=\"\",\"\",Cover!P4)","v":""},null,null,null,null,"NOTE ON DNF (Did Not Finish) CODES"]
[]
["Please enter the player Division Codes, Names and PDGA#s on this page before",null,null,null,null,null,null,null,null,null,null,null,null,null,null,null,"Enter 888 when a player has not notified the TD they will not be playing the next scheduled round. Enter 888 when a player has been confirmed to have manipulated their score or dropped out to preserve their rating. For all other cases where a player was not able to finish the round, enter 999."]
["completing the COVER page and using the PAYOUT worksheets. Do not include",null,null,null,null,null,null,null,null,null,null,null,null," Use Special Sort button above when"]
["players who registered but did not show up or make a throw in the tournament.",null,null,null,null,null,null,null,null,null,null,null,null,"your Event has Semi or Final round."]
["Click button to upload scores",null,null,null,null,null,null,"Use Basic Sort button after Rd1 thru  >",null,null,null,null,null,"You MUST enter Final rankings in Place"]
[null,null,null,null,null,null,null,"Rd4. Use Special Sort if Final round.    ",null,null,null,null,null,"column for players in Semi/Final.",null,null,"  Division Codes: Use the following 3 digit codes in the DivCode field."]
[null,null,null,null,null,null,null,null,null,null,null,null,null,"Am Cash"]
["DivCode",null,"Place","First Name","Last Name","PDGA","Rd1","Rd2","Rd3","Rd4","Final","Total","Cash/Value","Decline?",null,null,"PRO DIVISIONS - Cash Payout"]
[null,null,null,null,null,null,null,null,null,null,null,{"$f":"IF(SUM(G10:K10)=0,\"\",IF(SUM(G10:K10)>=888,\"DNF\",SUM(G10:K10)))","v":""},null,null,null,null,"RPA","GOLD - Open",null,"970+"]
{"$rows_left_out":491}
{"sheet":"Pro.Payouts","index":4,"n_rows":73,"n_cols":47,"rows_kept":73,"cut":false,"hidden":false,"merged":[[30,0,30,5],[29,0,29,5],[72,0,72,5]]}
[null,null,null,null,null,null,null,null,"Field","# paid"]
[null,null,null,null,null,null,null,null,null,40,45,50]
[null,null,null,null,null,null,null,null,1,1,1,1,null,"Number of Places Paid"]
[null,null,null,null,null,null,null,null,2,1,1,1,null,1,2,3,4,5,6,7,8,9,10,11,12,13,14,15,16,17,18,19,20,21,22,23,24,25,26,27,28,29,30,31,32,33]
[null,null,null,null,null,null,null,null,3,1,1,2,1,1,0.625,0.47499999999999998,0.41,0.36,0.33,0.3,0.28000000000000003,0.26800000000000002,0.26,0.25,0.23799999999999999,0.23200000000000001,0.22500000000000001,0.22,0.21,0.2,0.19,0.18,0.16500000000000001,0.152,0.14499999999999999,0.14199999999999999,0.14000000000000001,0.13700000000000001,0.13200000000000001,0.13,0.127,0.125,0.122,0.11799999999999999,0.115,0.112,1]
[null,null,null,null,null,null,null,null,4,2,2,2,2,"·········",0.375,0.3,0.26,0.245,0.23,0.21,0.19,0.185,0.18,0.16500000000000001,0.16,0.155,0.15,0.14499999999999999,0.14000000000000001,0.13500000000000001,0.13,0.125,0.11799999999999999,0.115,0.112,0.11,0.107,0.105,0.1,9.8000000000000004E-2,9.5000000000000001E-2,9.2999999999999999E-2,0.09,8.6999999999999994E-2,8.5000000000000006E-2,8.2000000000000003E-2,2]
[null,null,null,null,null,null,null,null,5,2,2,3,3,"3rd","·········",0.22500000000000001,0.19,0.17,0.155,0.15,0.14499999999999999,0.14000000000000001,0.13,0.127,0.12,0.115,0.11,0.105,0.1,9.7000000000000003E-2,9.5000000000000001E-2,9.1999999999999998E-2,8.8999999999999996E-2,8.6999999999999994E-2,8.5000000000000006E-2,8.4000000000000005E-2,8.2000000000000003E-2,7.8E-2,7.5999999999999998E-2,7.4999999999999997E-2,7.2999999999999995E-2,7.0999999999999994E-2,6.8000000000000005E-2,6.5000000000000002E-2,6.3E-2,5.8000000000000003E-2,3]
[null,null,null,null,null,null,null,null,6,2,3,3,4,null,"4th","·········",0.14000000000000001,0.125,0.12,0.11,0.115,0.11,0.1,9.8000000000000004E-2,9.5000000000000001E-2,0.09,8.5000000000000006E-2,8.4000000000000005E-2,8.3000000000000004E-2,8.1000000000000003E-2,0.08,7.8E-2,7.5999999999999998E-2,7.4999999999999997E-2,7.1999999999999995E-2,7.0999999999999994E-2,6.6000000000000003E-2,6.5000000000000002E-2,6.4000000000000001E-2,6.3E-2,6.0999999999999999E-2,5.8999999999999997E-2,5.6000000000000001E-2,5.5E-2,5.2999999999999999E-2,5.1999999999999998E-2,4]
[null,null,null,null,null,null,null,null,7,3,3,4,5,"P",null,"5th","·········",0.1,9.5000000000000001E-2,9.5000000000000001E-2,0.09,8.5000000000000006E-2,8.1000000000000003E-2,0.08,7.6999999999999999E-2,7.4999999999999997E-2,7.0999999999999994E-2,6.9000000000000006E-2,6.8000000000000005E-2,6.7000000000000004E-2,6.5000000000000002E-2,6.5000000000000002E-2,6.4000000000000001E-2,6.3E-2,6.0999999999999999E-2,0.06,5.7000000000000002E-2,5.6000000000000001E-2,5.5E-2,5.3999999999999999E-2,5.1999999999999998E-2,0.05,4.9000000000000002E-2,4.8000000000000001E-2,4.8000000000000001E-2,4.8000000000000001E-2,5]
[null,null,null,null,null,null,null,null,8,3,4,4,6,null,"L",null,"6th","·········",7.0000000000000007E-2,7.4999999999999997E-2,7.0000000000000007E-2,6.7000000000000004E-2,6.7000000000000004E-2,6.5000000000000002E-2,6.4000000000000001E-2,6.0999999999999999E-2,0.06,5.8000000000000003E-2,5.7000000000000002E-2,5.6000000000000001E-2,5.5E-2,5.5E-2,5.3999999999999999E-2,5.3999999999999999E-2,5.2999999999999999E-2,5.1999999999999998E-2,5.0999999999999997E-2,4.9000000000000002E-2,4.8000000000000001E-2,4.7E-2,4.5999999999999999E-2,4.4999999999999998E-2,4.4999999999999998E-2,4.4999999999999998E-2,4.4999999999999998E-2,4.4999999999999998E-2,6]
{"$rows_left_out":64}
{"sheet":"Unified.Payouts","index":5,"n_rows":148,"n_cols":61,"rows_kept":148,"cut":false,"hidden":false,"merged":[[147,14,147,19],[128,14,128,19],[86,0,86,5],[0,0,0,5],[0,7,0,12],[21,7,21,12],[41,0,41,5],[84,0,84,5],[43,0,43,5]]}
["BLUE DIVISION",null,null,null,null,null,null,"PURPLE DIVISION",null,null,null,null,null,null,null,null,null,null,null,null,null,null,null,null,null,null,null,null,null,null,null,null,null,null,null,null,null,null,null,null,null,null,null,null,null,null,null,null,null,null,null,null,null,null,null,null,0.5,null,null,0.45]
[null,null,null,null,"Enter Added Cash (or deduction) here* > ",0,null,null,null,null,null,"Enter Added Cash (or deduction) here* > ",0,null,null,null,null,null,null,null,null,null,null,null,null,null,null,null,null,null,null,null,null,null,null,null,null,null,null,null,null,null,null,null,null,null,null,null,null,null,null,null,null,null,null,null,"Field","# paid",null,"Field","# paid"]
["# Paid",null,"Field Size","Pay pct","Total Fees: ",{"$f":"Cover!G21+Cover!M21","v":0},null,"# Paid",null,"Field Size","Pay pct","Total Fees: ",{"$f":"Cover!G25+Cover!M25","v":0}]
[{"$f":"IF(D4=45%,VLOOKUP(C4,dbd,2,FALSE),VLOOKUP(C4,dbe,2,FALSE))","v":{"$error":"#N/A"}},null,{"$f":"IF(Cover!F21=0,91,Cover!F21+ROUNDDOWN(Cover!L21/3,0))","v":91},0.45,"Net Purse: ",{"$f":"F3+F2","v":0},null,{"$f":"IF(K4=45%,VLOOKUP(J4,dbd,2,FALSE),VLOOKUP(J4,dbe,2,FALSE))","v":{"$error":"#N/A"}},null,{"$f":"IF(Cover!F25=0,91,Cover!F25+ROUNDDOWN(Cover!L25/3,0))","v":91},0.45,"Net Purse: ",{"$f":"M3+M2","v":0},null,null,null,null,null,null,null,null,null,null,null,null,null,null,null,null,null,null,null,null,null,null,null,null,null,null,null,null,null,null,null,null,null,null,null,null,null,null,null,null,null,null,null,1,1,null,1,1]
[null,null,null,{"$f":"IF(C4=91,\"       To use this table, enter player divisions on Scores page\",IF(C4>75,\"Field limit exceeded. Use printed Payout tables.\",\"\"))","v":"       To use this table, enter player divisions on Scores page"},null,null,null,null,null,null,{"$f":"IF(J4=91,\"       To use this table, enter player divisions on Scores page\",IF(J4>30,\"Field limit exceeded. Use printed Payout tables.\",\"\"))","v":"       To use this table, enter player divisions on Scores page"},null,null,null,null,null,null,null,null,null,null,null,null,null,null,null,null,null,null,null,null,null,null,null,null,null,null,null,null,null,null,null,null,null,null,null,null,null,null,null,null,null,null,null,null,null,2,1,null,2,1]
[null,"Prelim","Proposed","Round","Manual","Final",null,null,"Prelim","Proposed","Round","Manual","Final",null,null,null,null,null,null,null,null,null,null,null,null,null,null,null,null,null,null,null,null,null,null,null,null,null,null,null,null,null,null,null,null,null,null,null,null,null,null,null,null,null,null,null,3,2,null,3,1]
["Place","Factor","Payout $$","to $5","Adj. ","Place",null,"Place","Factor","Payout $$","to $5","Adj. ","Place",null,null,null,null,null,null,null,null,null,null,null,null,null,null,null,null,null,null,null,null,null,null,null,null,null,null,null,null,null,null,null,null,null,null,null,null,null,null,null,null,null,null,null,4,2,null,4,2]
[{"$f":"IF(ROW()-7>$A$4,\"\",ROW()-7)","v":{"$error":"#N/A"}},{"$f":"IF(A8>$A$4,\"\",IF(D$4=45%,VLOOKUP(A8,__pay5,$A$4+1),VLOOKUP(A8,__pay3,$A$4+1)))","v":{"$error":"#N/A"}},{"$f":"IF(B8=\"\",\"\",$F$4*B8)","v":{"$error":"#N/A"}},{"$f":"IF(C8=\"\",\"\",INT((C8+2.5)/5)*5)","v":{"$error":"#N/A"}},null,null,null,{"$f":"IF(ROW()-7>$H$4,\"\",ROW()-7)","v":{"$error":"#N/A"}},{"$f":"IF(K$4=45%,VLOOKUP(H8,__pay5,$H$4+1),VLOOKUP(H8,__pay3,$H$4+1))","v":{"$error":"#N/A"}},{"$f":"IF(I8=\"\",\"\",$M$4*I8)","v":{"$error":"#N/A"}},{"$f":"IF(J8=\"\",\"\",INT((J8+2.5)/5)*5)","v":{"$error":"#N/A"}},null,null,null,null,null,null,null,null,null,null,null,null,null,null,null,null,null,null,null,null,null,null,null,null,null,null,null,null,null,null,null,null,null,null,null,null,null,null,null,null,null,null,null,null,null,5,3,null,5,2]
[{"$error":"#N/A"},{"$f":"IF(A9=\"\",\"\",IF(D$4=45%,VLOOKUP(A9,__pay5,A$4+1),VLOOKUP(A9,__pay3,A$4+1)))","v":{"$error":"#N/A"}},{"$f":"IF(B9=\"\",\"\",$F$4*B9)","v":{"$error":"#N/A"}},{"$error":"#N/A"},null,null,null,{"$error":"#N/A"},{"$f":"IF(H9=\"\",\"\",IF(K$4=45%,VLOOKUP(H9,__pay5,H$4+1),VLOOKUP(H9,__pay3,H$4+1)))","v":{"$error":"#N/A"}},{"$f":"IF(I9=\"\",\"\",$M$4*I9)","v":{"$error":"#N/A"}},{"$error":"#N/A"},null,null,null,null,null,null,null,null,null,null,null,null,null,null,null,null,null,null,null,null,null,null,null,null,null,null,null,null,null,null,null,null,null,null,null,null,null,null,null,null,null,null,null,null,null,6,3,null,6,3]
[{"$error":"#N/A"},{"$error":"#N/A"},{"$error":"#N/A"},{"$error":"#N/A"},null,null,null,{"$error":"#N/A"},{"$error":"#N/A"},{"$error":"#N/A"},{"$error":"#N/A"},null,null,null,null,null,null,null,null,null,null,null,null,null,null,null,null,null,null,null,null,null,null,null,null,null,null,null,null,null,null,null,null,null,null,null,null,null,null,null,null,null,null,null,null,null,7,4,null,7,3]
{"$rows_left_out":139}
{"sheet":"Finance","index":6,"n_rows":78,"n_cols":20,"rows_kept":78,"cut":false,"hidden":false,"merged":[[4,11,4,14],[20,11,20,13],[41,0,41,15],[28,11,28,13],[29,11,29,13],[30,7,30,9],[21,11,21,13],[25,11,25,13],[6,11,6,13],[32,11,32,13],[40,0,40,15],[26,11,26,13],[30,11,30,13],[31,11,31,13],[27,11,27,13],[35,7,35,9],[35,4,35,5],[28,0,28,2],[30,0,30,2],[32,0,32,2],[31,0,31,2],[33,4,33,5],[34,4,34,5],[35,0,35,2],[2,2,2,4],[4,0,4,2],[4,7,4,9],[49,0,49,4],[47,0,47,4],[34,0,34,2],[33,0,33,2],[17,7,17,9],[6,0,6,2],[6,7,6,9],[46,0,46,4],[44,8,44,9],[46,8,46,13],[48,8,48,13],[48,0,48,4],[9,0,9,2],[6,4,6,5],[7,0,7,2],[7,4,7,5],[7,7,7,9],[19,0,19,2],[15,4,15,5],[16,4,16,5],[17,4,17,5],[8,0,8,2],[18,7,18,9],[15,7,15,9],[16,7,16,9],[7,11,7,13],[8,11,8,13],[9,11,9,13],[22,4,22,5],[21,4,21,5],[20,0,20,2],[22,11,22,13],[29,0,29,2],[9,4,9,5],[10,4,10,5],[12,4,12,5],[13,4,13,5],[14,4,14,5],[18,4,18,5],[19,4,19,5],[16,0,16,2],[17,0,17,2],[18,0,18,2],[20,4,20,5],[23,4,23,5],[24,4,24,5],[15,0,15,2],[24,11,24,13],[9,7,9,9],[11,4,11,5],[29,4,29,5],[25,7,25,9],[27,4,27,5],[29,7,29,9],[27,7,27,9],[24,7,24,9],[23,11,23,13],[19,11,19,13],[16,11,16,13],[17,11,17,13],[18,11,18,13],[15,11,15,13],[23,7,23,9],[20,7,20,9],[28,7,28,9],[22,7,22,9],[21,7,21,9],[31,7,31,9],[28,4,28,5],[25,4,25,5],[26,4,26,5],[31,4,31,5],[26,7,26,9],[30,4,30,5],[19,7,19,9],[8,7,8,9],[8,4,8,5],[49,8,49,13],[62,8,62,13],[58,8,58,13],[61,8,61,13],[56,8,56,13],[59,8,59,13],[52,8,52,13],[57,8,57,13],[32,4,32,5],[32,7,32,9],[34,7,34,9],[50,8,50,13],[35,11,35,14],[33,11,33,13],[34,11,34,13],[33,7,33,9],[42,0,42,15],[47,8,47,13],[60,0,60,4],[60,8,60,13],[57,0,57,4],[53,0,53,4],[52,0,52,4],[58,0,58,4],[64,8,64,13],[72,0,72,4],[69,8,69,13],[72,8,72,13],[71,8,71,13],[65,8,65,13],[65,0,65,4],[70,8,70,13],[51,8,51,13],[68,8,68,13],[66,8,66,13],[67,0,67,4],[66,0,66,4],[67,8,67,13],[64,0,64,4],[63,0,63,4],[63,8,63,13],[68,0,68,4],[59,0,59,4],[61,0,61,4],[54,0,54,4],[56,0,56,4],[62,0,62,4],[55,0,55,4],[77,8,77,13],[70,0,70,4],[69,0,69,4],[71,0,71,4],[76,8,76,13],[74,8,74,13],[73,8,73,13],[76,0,76,4],[74,0,74,4],[73,0,73,4],[56,19,56,21],[57,19,57,21],[46,19,46,21],[47,19,47,21],[48,19,48,21],[49,19,49,21],[50,19,50,21],[51,19,51,21],[52,19,52,21],[53,19,53,21],[54,19,54,21],[55,19,55,21]]}
[null,null,null,null,null,null,null," PDGA Tour Event: Financial Summary"]
[]
["Part 1:",null,"Sponsors",null,null,null,"Please list all sponsors and their contributions."]
[]
["Cash Sponsors",null,null,null,"Amount",null,null,"Non Cash Sponsors",null,null,null,"Description of Donation",null,null,null,"Value"]
[]
[]
[]
[]
[]
{"$rows_left_out":69}
{"sheet":"$10 Fees","index":7,"n_rows":12,"n_cols":10,"rows_kept":12,"cut":false,"hidden":false,"merged":[[6,0,9,9]]}
["List of Non-Current Players / Supporting Members Paying the $10 PDGA Fee"]
[]
["Instructions: PDGA current membership is required at all Majors, National Tour and SuperTour (A Tier) events. For all other events, non-current or non-member"]
["players may participate by paying a $10 fee to the PDGA in lieu of membership. This fee is required of ALL players who cannot prove current membership, except"]
["for players competing in a Junior division."]
[]
["New players who pay the $10 fee are eligible for a $10 discount when registering as a new member of the PDGA. The discount can only be applied to membership registration received during the same calendar year as the $10 fee.  Players should use the code NONMEMBER10 to receive this discount.  TDs are encouraged to provide PDGA membership forms to any player who is not current."]
[]
[]
[]
{"$rows_left_out":3}
{"sheet":"Membership Form","index":8,"n_rows":80,"n_cols":22,"rows_kept":80,"cut":false,"hidden":false,"merged":[[42,2,42,22],[62,21,62,22]]}
[]
[]
[]
[]
[]
[]
[]
[null,null,null,null,"               PDGA Membership Form - USA & CANADA "]
[]
[]
{"$rows_left_out":71}
{"sheet":"Memberships","index":9,"n_rows":40,"n_cols":13,"rows_kept":40,"cut":false,"hidden":false,"merged":[[12,0,14,12],[39,1,39,4],[38,1,38,4],[6,4,6,11]]}
["PDGA Memberships Collected",null,null,null,null,null,"Tour Event Name:",""]
[]
["Instructions: ",null,"Please provide details on any players who paid their PDGA membership at your event. Please submit this information as part of your electronic"]
[null,null,"TD report as soon as possible following your event. This information is required in order for the PDGA office to process and finalize your event results,"]
[null,null,"and it enables the PDGA to respond to these customers with timely service. Thanks very much !"]
[]
["Fees:",null,"Pro:         $75"]
[null,null,"Amateur: $50"]
[null,null,"Junior:    $30",null,"(18 years old or younger)"]
["Family Discount: $5 discount for each additional PDGA membership at the same address. Only one copy of DiscGolfer Magazine will be shipped per family."]
{"$rows_left_out":31}
{"sheet":"Evaluation Form","index":10,"n_rows":39,"n_cols":13,"rows_kept":39,"cut":false,"hidden":false,"merged":[[30,0,30,15],[31,0,31,15],[26,0,26,15],[27,0,27,15],[28,0,28,15],[29,0,29,15],[24,0,24,15],[25,0,25,15],[9,2,9,8],[9,12,9,15],[11,2,11,8],[11,12,11,13],[18,12,18,15],[23,0,23,15]]}
[null,null,null,null,null,null,null,null,null,"PDGA  Tour Event Evaluation Form"]
[]
[]
[null,null,"This form gives players the opportunity to provide feedback on Tour Events to the PDGA & TDs. "]
[null,null,"Most events run pretty smooth, are lots of fun, and have a few problems. That is the norm."]
[null,null,"Players are encouraged to use this form whenever an event or something about it was superb,"]
[null,null,"or when an event fell short of their expectations, and to provide detail as they feel appropriate."]
[]
[]
["Event:",null," ",null,null,null,null,null,null,null,"Date(s):",null," "]
{"$rows_left_out":30}
{"sheet":"SupportData","index":11,"n_rows":26,"n_cols":7,"rows_kept":26,"cut":false,"hidden":true,"merged":[]}
["This worksheet contains data used by other worksheets and formulas in this file."]
["Please do not delete this worksheet or modify any data on it."]
[]
["Divcode",null,"Tier","Code","Fee","Tier 1","Tier 2"]
["RPA",null,"NT",1,5,"NT"]
["RAH",null,"A / XA",2,4,"A / XA"]
["RAD",null,"B / XB",3,3,"B / XB"]
["RAE",null,"C / XC",4,2,"C / XC"]
["RAF",null,"A Pro / B Am",9,null,"Pro A","Am B"]
["RAG",null,"A Pro / C Am",10,null,"Pro A","Am C"]
{"$rows_left_out":16}