{"text_format":"1","workbook":"xlsx","n_sheets":8,"sheets":["Instructions","Cover","Event Info","Scores","Pro.Payouts","Am.Jr.Payouts","Finance","SupportData"],"not_rendered":{"charts":0,"images":1,"macros":1,"external_links":0,"defined_names":39,"comments":2,"pivot_tables":0},"unopened":[],"bounds":{"document_bytes":16777216,"sheet_cells":100000,"rows_first":2000,"rows_last":500,"rows_between":2000,"halvings":0,"cell_chars":16384,"cell_head_chars":4096},"cells_cut":0,"cells_raw":0,"read":"whole","date_system":"1900"}

{"sheet":"Instructions","index":0,"n_rows":71,"n_cols":5,"rows_kept":71,"cut":false,"hidden":false,"merged":[[21,4,21,6],[22,4,22,6],[14,4,14,6],[15,4,15,6],[11,4,12,6],[23,4,23,6],[13,4,13,6],[24,4,24,6],[16,4,16,6],[18,4,18,6],[19,4,19,6],[20,4,20,6]]}
[]
[null,null,"Guide to the PDGA Tour International Event Report"]
[null,null,{"$f":"CONCATENATE(\"Version \",Cover!A1)","v":"Version 16.3"}]
[null,null,"Dear PDGA Tournament Director,"]
[]
[null,null,"Thanks for directing a PDGA Tour Event! The TD report has been updated to M/S Excel 2007+"]
[null,null,"and serves as a key component of the PDGA's database system in M/S Access. All TDs are expected"]
[null,null,"to use this tool and to return their completed event report to the PDGA by email as an attached"]
[null,null,"file as soon as possible. This will speed the processing of your event including the posting of official"]
[null,null,"results at www.pdga.com, and the calculation of player statistics including ratings."]
{"$rows_left_out":62}
{"sheet":"Cover","index":1,"n_rows":51,"n_cols":24,"rows_kept":51,"cut":false,"hidden":false,"merged":[[22,8,22,10],[23,8,23,10],[6,16,6,18],[9,15,9,19],[19,8,19,10],[9,9,9,10],[20,8,20,10],[15,8,15,10],[21,8,21,10],[43,13,43,18],[3,18,3,19],[1,11,1,19],[8,15,8,19],[37,13,37,18],[18,13,18,18],[14,15,14,19],[3,15,3,16],[27,13,27,18],[11,8,14,12],[30,8,30,10],[24,8,24,10],[25,8,25,10],[26,8,26,10],[27,8,27,10],[28,8,28,10],[29,8,29,10]]}
[16.3]
["              PDGA Tour International Event Report",null,null,null,null,null,null,null,null,null,"Event: "]
[null,"Enter fees 'per player' in the yellow boxes using your local currency selected below."]
[null,"Player Names and DivCodes must be entered on the \"Scores\" sheet to see player counts.",null,null,null,null,null,null,null,null,null,null,null,null,"Date(s): ",null,null,"to"]
[null,"Gross","PDGA","Other","Net","# of","Total Net",null,null,null,null,null,null,null,null,null,null,null,null,null,null,null,null,"Gross"]
["PROS","Entry","Fee","Fees","Entry","Plyrs","Entry Fees",null,null,null,null,null,null,null,null,null,null,null,null,null,null,null,null,"Entry Fees"]
["Open",null,{"$f":"IF(AND(F7<>0,M$8=\"Yes\"),5*N$16,0)","v":0},null,{"$f":"B7-C7-D7","v":0},{"$f":"COUNTIF(Division,\"MPO\")","v":0},{"$f":"F7*E7","v":0},null,null,null,null,"Choose Currency > ","Euro €",null,null,"Tier: ",null,null,null,null,null,null,"Pro",{"$f":"SUM(B7:B18*F7:F18)","v":0}]
["Master",null,0,null,0,{"$f":"COUNTIF(Division,\"MPM\")","v":0},{"$f":"F8*E8","v":0},null,null,null,null,"Euro Tour Event? > ","No",null,null,null,null,null,null,null,null,null,"Am",{"$f":"SUM(B21:B36*F21:F36)","v":0}]
["Grandmaster",null,0,null,0,{"$f":"COUNTIF(Division,\"MPG\")","v":0},0,null,null,null,null,null,null,null,"TD Name: ",null,null,null,null,null,null,null,"Jr",{"$f":"SUM(B39:B50*F39:F50)","v":0}]
["Sr Grandmaster",null,0,null,0,{"$f":"COUNTIF(Division,\"MPS\")","v":0},0,null,null,{"$f":"IF(M7=\"\",\"\",M7)","v":"Euro €"},null,"to","US $",null,"Email Addr: ","@",null,null,null,null,null,null,null,{"$f":"SUM(X7:X9)","v":0}]
{"$rows_left_out":42}
{"sheet":"Event Info","index":2,"n_rows":119,"n_cols":20,"rows_kept":119,"cut":false,"hidden":false,"merged":[[81,1,81,3],[74,1,74,17],[100,1,100,17],[95,1,95,17],[88,1,88,17],[82,1,82,3],[83,1,83,3],[93,1,93,17],[94,1,94,17],[87,1,87,17],[107,1,107,8],[107,10,107,17],[101,1,101,17],[102,1,102,17],[89,1,89,17],[80,1,80,3],[62,1,62,3],[63,1,63,3],[64,1,64,3],[65,1,65,3],[70,1,70,3],[73,1,73,17],[79,6,79,7],[79,4,79,5],[66,1,66,3],[59,1,59,3],[60,1,60,3],[55,1,55,3],[56,1,56,3],[75,1,75,17],[79,16,79,17],[67,1,67,3],[68,1,68,3],[69,1,69,3],[61,1,61,3],[8,11,8,15],[9,11,9,15],[10,11,10,15],[16,11,16,15],[11,11,11,15],[12,11,12,15],[13,11,13,15],[8,5,8,9],[29,1,29,3],[59,0,70,0],[41,1,41,3],[42,1,42,3],[43,1,43,3],[44,1,44,3],[45,1,45,3],[48,1,48,3],[49,1,49,3],[50,1,50,3],[46,1,46,3],[29,0,40,0],[41,0,56,0],[30,1,30,3],[54,1,54,3],[53,1,53,3],[47,1,47,3],[8,1,8,3],[40,1,40,3],[33,1,33,3],[37,1,37,3],[38,1,38,3],[39,1,39,3],[36,1,36,3],[31,1,31,3],[32,1,32,3],[18,11,18,15],[8,19,9,21],[16,19,16,21],[25,19,25,21],[12,19,12,21],[13,19,13,21],[14,19,14,21],[15,19,15,21],[10,19,10,21],[28,19,28,21],[11,19,11,21],[27,19,27,21],[26,19,26,21],[21,11,21,15],[14,11,14,15],[19,11,19,15],[15,11,15,15],[20,11,20,15],[17,11,17,15]]}
["PDGA Tour Event Report: General Information"]
[]
["1.","Course Layouts - Important!",null,null,null,null,null,null,null,null,null,null,null,null,null,null,null,"Please enter your permanent courses in the PDGA Course Directory"]
[]
[null,"The PDGA uses Player Ratings for calculating amateur division eligibility. In order to accomplish this,"]
[null,"it is VERY IMPORTANT that you complete the following information accurately. If the course(s) used are"]
[null,"listed in the PDGA Course Directory please ensure that the same course name(s) are used as appear in the directory."]
[]
["Layout","Please do not use apostrophes in any names or words!",null,null,null,"Number of Holes",null,null,null,null,null,"Length",null,null,null,null,null,"Meas?",null,"NOTE"]
["Code","Park or Course Name",null," Specific Layout / Configuration Name",null,"Perm",null,"Temp",null,"TOT",null,"(meters)",null,null,null,null,null,"or Est?"]
{"$rows_left_out":110}
{"sheet":"Scores","index":3,"n_rows":225,"n_cols":25,"rows_kept":225,"cut":false,"hidden":false,"merged":[[42,15,42,17],[42,18,42,20],[43,18,43,20],[39,15,39,17],[40,15,40,17],[41,15,41,17],[39,18,39,20],[40,18,40,20],[41,18,41,20],[0,3,0,8],[0,12,0,13],[37,15,38,17],[37,18,37,20],[2,15,5,25],[0,15,0,21],[6,15,6,25],[38,18,38,20]]}
["Tour Event Name:",null,null,{"$f":"IF(Cover!L2<>\"\",Cover!L2,\"\")","v":""},null,null,null,null,null,null,null,"Dates:",{"$f":"IF(Cover!P4<>\"\",Cover!P4,\"\")","v":""},null,null,"NOTE ON DNF (Did Not Finish) CODES"]
[]
["Please enter the player Division Codes, Names and PDGA#s on this page before",null,null,null,null,null,null,null,null,null,null,null,null,null,null,"Enter 888 when a player has not notified the TD they will not be playing the next scheduled round. Enter 888 when a player has been confirmed to have manipulated their score or dropped out to preserve their rating. For all other cases where a player was not able to finish the round, enter 999."]
["completing the COVER page and using the PAYOUT worksheets. Do not include"]
["players who registered but did not show up or make a throw in the tournament.",null,null,null,null,null,null,null,null,null,null,null,null," Use Special Sort button above when"]
["Click button to upload scores",null,null,null,null,null,null,"Use Basic Sort button after any  >",null,null,null,null,null,"your Event has Semis or Finals."]
[null,null,null,null,null,null,null,"round through first 4 rounds.    ",null,null,null,null,null,"You MUST enter Final rankings in Place",null,"Guide to Division Codes: Enter players using the following 3 digit codes in the DivCode field."]
[null,null,null,null,null,null,null,null,null,null,null,null,null,"column for players in Semis/Finals.",null,"PROFESSIONAL DIVISIONS",null,null,null,"AMATEUR DIVISIONS",null,null,null,"JUNIOR DIVISIONS"]
["DivCode","Place","First Name","Last Name","PDGA","Rd1","Rd2","Rd3","Rd4","Semi","Final","TOTAL","Cash/Local","Cash/Value",null,"MPO","Pro Open",null,null,"MA1","Advanced",null,null,"MJ1","Junior Boys < 19"]
[null,null,null,null,null,null,null,null,null,null,null,{"$f":"IF(F10=\"\",\"\",IF(SUM(F10:K10)>=888,\"DNF\",SUM(F10:K10)))","v":""},null,{"$f":"IF(M10=\"\",\"\",M10*Cover!M$11)","v":""},null,"MPM","Pro Master",null,null,"MA2","Intermediate",null,null,"MJ2","Junior Boys < 16"]
{"$rows_left_out":216}
{"sheet":"Pro.Payouts","index":4,"n_rows":84,"n_cols":62,"rows_kept":84,"cut":false,"hidden":false,"merged":[[20,7,20,12],[30,14,30,19],[51,14,51,19],[20,14,20,19],[73,14,73,19],[73,0,73,5],[73,7,73,12],[0,0,0,5],[0,7,0,12],[0,14,0,19],[30,0,30,5],[30,7,30,12]]}
["WOMEN PRO DIVISION",null,null,null,null,null,null,"WOMEN MASTER PRO DIVISION",null,null,null,null,null,null,"WOMEN GM PRO DIVISION",null,null,null,null,null,null,"Field"]
[null,null,null,null,"Add (or reduce) local cash here* > ",null,null,null,null,null,null,"Add (or reduce) local cash here* > ",null,null,null,null,null,null,"Add (or reduce) local cash here* > ",0,null,null,40,33,25,20,15,null,"1-2","3-4","5-6","7-9","10-13","14-16","17-19","20-22","23-26","27-29","30-31"]
["# Paid",null,"Field Size",null,"Total Fees: ",{"$f":"Cover!G14","v":0},null,"# Paid",null,"Field Size",null,"Total Fees: ",{"$f":"Cover!G15","v":0},null,"# Paid",null,"Field Size",null,"Total Fees: ",{"$f":"Cover!G16","v":0},null,1,1,1,1,1,1,null,"Number of Places Paid"]
[{"$f":"VLOOKUP(C4,paypct,B5,FALSE)","v":{"$error":"#N/A"}},null,{"$f":"IF(Cover!F14=0,91,Cover!F14)","v":91},null,"Net Purse: ",{"$f":"F3+F2","v":0},null,{"$f":"VLOOKUP(J4,paypct,I5,FALSE)","v":{"$error":"#N/A"}},null,{"$f":"IF(Cover!F15=0,91,Cover!F15)","v":91},null,"Net Purse: ",{"$f":"M3+M2","v":0},null,{"$f":"VLOOKUP(Q4,paypct,P5,FALSE)","v":{"$error":"#N/A"}},null,{"$f":"IF(Cover!F16=0,91,Cover!F16)","v":91},null,"Net Purse: ",{"$f":"T3+T2","v":0},null,2,1,1,1,1,1,null,1,2,3,4,5,6,7,8,9,10,11,12,13,14,15,16,17,18,19,20,21,22,23,24,25,26,27,28,29,30,31,32,33]
[null,{"$f":"IF(E5=33%,3,IF(E5=40%,2,IF(E5=25%,4,IF(E5=20%,5,6))))","v":4},null,"Choose Payout Percentage>",0.25,null,null,null,{"$f":"IF(L5=33%,3,IF(L5=40%,2,IF(L5=25%,4,IF(L5=20%,5,6))))","v":4},null,"Choose Payout Percentage>",0.25,null,null,null,{"$f":"IF(S5=33%,3,IF(S5=40%,2,IF(S5=25%,4,IF(S5=20%,5,6))))","v":4},null,"Choose Payout Percentage>",0.25,null,null,3,2,1,1,1,1,1,1,0.625,0.47499999999999998,0.41,0.36,0.33,0.3,0.28000000000000003,0.26800000000000002,0.26,0.25,0.23799999999999999,0.23200000000000001,0.22500000000000001,0.22,0.21,0.2,0.19,0.18,0.16500000000000001,0.152,0.14499999999999999,0.14199999999999999,0.14000000000000001,0.13700000000000001,0.13200000000000001,0.13,0.127,0.125,0.122,0.11799999999999999,0.115,0.112,1]
[null,"Prelim","Proposed","Round to","Manual","Final",null,null,"Prelim","Proposed","Round to","Manual","Final",null,null,"Prelim","Proposed","Round to","Manual","Final",null,4,2,2,1,1,1,2,"·········",0.375,0.3,0.26,0.245,0.23,0.21,0.19,0.185,0.18,0.16500000000000001,0.16,0.155,0.15,0.14499999999999999,0.14000000000000001,0.13500000000000001,0.13,0.125,0.11799999999999999,0.115,0.112,0.11,0.107,0.105,0.1,9.8000000000000004E-2,9.5000000000000001E-2,9.2999999999999999E-2,0.09,8.6999999999999994E-2,8.5000000000000006E-2,8.2000000000000003E-2,2]
["Place","Factor","Local Pay","nearest 5","Adj. (Local)","Place",null,"Place","Factor","Local Pay","nearest 5","Adj. (Local)","Place",null,"Place","Factor","Local Pay","nearest 5","Adj. (Local)","Place",null,5,2,2,2,1,1,3,"3rd","·········",0.22500000000000001,0.19,0.17,0.155,0.15,0.14499999999999999,0.14000000000000001,0.13,0.127,0.12,0.115,0.11,0.105,0.1,9.7000000000000003E-2,9.5000000000000001E-2,9.1999999999999998E-2,8.8999999999999996E-2,8.6999999999999994E-2,8.5000000000000006E-2,8.4000000000000005E-2,8.2000000000000003E-2,7.8E-2,7.5999999999999998E-2,7.4999999999999997E-2,7.2999999999999995E-2,7.0999999999999994E-2,6.8000000000000005E-2,6.5000000000000002E-2,6.3E-2,5.8000000000000003E-2,3]
[{"$f":"IF(ROW()-7>$A$4,\"\",ROW()-7)","v":{"$error":"#N/A"}},{"$f":"IF(A8=\"\",\"\",VLOOKUP(A8,_pay1,$A$4+1))","v":{"$error":"#N/A"}},{"$f":"IF(B8=\"\",\"\",$F$4*B8)","v":{"$error":"#N/A"}},{"$f":"IF(C8=\"\",\"\",INT((C8+2.5)/5)*5)","v":{"$error":"#N/A"}},null,null,null,{"$f":"IF(ROW()-7>$H$4,\"\",ROW()-7)","v":{"$error":"#N/A"}},{"$f":"IF(H8=\"\",\"\",VLOOKUP(H8,_pay1,$H$4+1))","v":{"$error":"#N/A"}},{"$f":"IF(I8=\"\",\"\",$M$4*I8)","v":{"$error":"#N/A"}},{"$f":"IF(J8=\"\",\"\",INT((J8+2.5)/5)*5)","v":{"$error":"#N/A"}},null,null,null,{"$f":"IF(ROW()-7>$O$4,\"\",ROW()-7)","v":{"$error":"#N/A"}},{"$f":"IF(O8=\"\",\"\",VLOOKUP(O8,_pay1,$O$4+1))","v":{"$error":"#N/A"}},{"$f":"IF(P8=\"\",\"\",$T$4*P8)","v":{"$error":"#N/A"}},{"$f":"IF(Q8=\"\",\"\",INT((Q8+2.5)/5)*5)","v":{"$error":"#N/A"}},null,null,null,6,3,2,2,2,1,4,null,"4th","·········",0.14000000000000001,0.125,0.12,0.11,0.115,0.11,0.1,9.8000000000000004E-2,9.5000000000000001E-2,0.09,8.5000000000000006E-2,8.4000000000000005E-2,8.3000000000000004E-2,8.1000000000000003E-2,0.08,7.8E-2,7.5999999999999998E-2,7.4999999999999997E-2,7.1999999999999995E-2,7.0999999999999994E-2,6.6000000000000003E-2,6.5000000000000002E-2,6.4000000000000001E-2,6.3E-2,6.0999999999999999E-2,5.8999999999999997E-2,5.6000000000000001E-2,5.5E-2,5.2999999999999999E-2,5.1999999999999998E-2,4]
[{"$error":"#N/A"},{"$error":"#N/A"},{"$error":"#N/A"},{"$error":"#N/A"},null,null,null,{"$error":"#N/A"},{"$error":"#N/A"},{"$error":"#N/A"},{"$error":"#N/A"},null,null,null,{"$error":"#N/A"},{"$error":"#N/A"},{"$error":"#N/A"},{"$error":"#N/A"},null,null,null,7,3,3,2,2,2,5,"P",null,"5th","·········",0.1,9.5000000000000001E-2,9.5000000000000001E-2,0.09,8.5000000000000006E-2,8.1000000000000003E-2,0.08,7.6999999999999999E-2,7.4999999999999997E-2,7.0999999999999994E-2,6.9000000000000006E-2,6.8000000000000005E-2,6.7000000000000004E-2,6.5000000000000002E-2,6.5000000000000002E-2,6.4000000000000001E-2,6.3E-2,6.0999999999999999E-2,0.06,5.7000000000000002E-2,5.6000000000000001E-2,5.5E-2,5.3999999999999999E-2,5.1999999999999998E-2,0.05,4.9000000000000002E-2,4.8000000000000001E-2,4.8000000000000001E-2,4.8000000000000001E-2,5]
[{"$error":"#N/A"},{"$error":"#N/A"},{"$error":"#N/A"},{"$error":"#N/A"},null,null,null,{"$error":"#N/A"},{"$error":"#N/A"},{"$error":"#N/A"},{"$error":"#N/A"},null,null,null,{"$error":"#N/A"},{"$error":"#N/A"},{"$error":"#N/A"},{"$error":"#N/A"},null,null,null,8,4,3,2,2,2,6,null,"L",null,"6th","·········",7.0000000000000007E-2,7.4999999999999997E-2,7.0000000000000007E-2,6.7000000000000004E-2,6.7000000000000004E-2,6.5000000000000002E-2,6.4000000000000001E-2,6.0999999999999999E-2,0.06,5.8000000000000003E-2,5.7000000000000002E-2,5.6000000000000001E-2,5.5E-2,5.5E-2,5.3999999999999999E-2,5.3999999999999999E-2,5.2999999999999999E-2,5.1999999999999998E-2,5.0999999999999997E-2,4.9000000000000002E-2,4.8000000000000001E-2,4.7E-2,4.5999999999999999E-2,4.4999999999999998E-2,4.4999999999999998E-2,4.4999999999999998E-2,4.4999999999999998E-2,4.4999999999999998E-2,6]
{"$rows_left_out":75}
{"sheet":"Am.Jr.Payouts","index":5,"n_rows":198,"n_cols":67,"rows_kept":198,"cut":false,"hidden":false,"merged":[[167,0,167,5],[179,0,179,5],[179,7,179,12],[179,14,179,19],[108,7,108,12],[108,14,108,19],[128,0,128,5],[128,7,128,12],[128,14,128,19],[165,14,165,19],[148,0,148,5],[148,7,148,12],[148,14,148,19],[159,7,159,12],[56,7,56,12],[65,14,65,19],[69,7,69,12],[86,0,86,5],[86,7,86,12],[86,14,86,19],[0,0,0,5],[0,7,0,12],[0,14,0,19],[22,7,22,12],[22,14,22,19],[43,0,43,5],[43,7,43,12],[43,14,43,19]]}
["ADVANCED DIVISION",null,null,null,null,null,null,"ADVANCED MASTERS DIVISION",null,null,null,null,null,null,"ADVANCED WOMEN DIVISION",null,null,null,null,null,null,null,null,null,null,null,null,null,null,null,null,null,null,null,null,null,null,null,null,null,null,null,null,null,null,null,null,null,null,null,null,null,null,null,null,null,0.33,null,null,0.45,null,0.25,null,0.2,null,0.15]
[null,null,null,null,"Add (or reduce) local cash here* > ",0,null,null,null,null,null,"Add (or reduce) local cash here* > ",0,null,null,null,null,null,"Add (or reduce) local cash here* > ",0,null,null,null,null,null,null,null,null,null,null,null,null,null,null,null,null,null,null,null,null,null,null,null,null,null,null,null,null,null,null,null,null,null,null,null,null,"Field","# paid",null,"Field","# paid","Field","# paid","Field","# paid","Field","# paid"]
["# Paid",null,"Field Size","Pay pct","Total Fees: ",{"$f":"Cover!G21","v":0},null,"# Paid",null,"Field Size","Pay pct","Total Fees: ",{"$f":"Cover!G25","v":0},null,"# Paid",null,"Field Size","Pay pct","Total Fees: ",{"$f":"Cover!G33","v":0}]
[{"$f":"IF(D4=45%,VLOOKUP(C4,dbd,2,FALSE),IF(D4=33%,VLOOKUP(C4,dbe,2,FALSE),IF(D4=25%,VLOOKUP(C4,dbf,2,FALSE),IF(D4=20%,VLOOKUP(C4,dbg,2,FALSE),VLOOKUP(C4,dbh,2,FALSE)))))","v":23},null,{"$f":"IF(Cover!F21=0,91,Cover!F21)","v":91},0.25,"Net Purse: ",{"$f":"F3+F2","v":0},null,{"$f":"IF(K4=45%,VLOOKUP(J4,dbd,2,FALSE),IF(K4=33%,VLOOKUP(J4,dbe,2,FALSE),IF(K4=25%,VLOOKUP(J4,dbf,2,FALSE),IF(K4=20%,VLOOKUP(J4,dbg,2,FALSE),VLOOKUP(J4,dbh,2,FALSE)))))","v":23},null,{"$f":"IF(Cover!F25=0,91,Cover!F25)","v":91},0.25,"Net Purse: ",{"$f":"M3+M2","v":0},null,{"$f":"IF(R4=45%,VLOOKUP(Q4,dbd,2,FALSE),IF(R4=33%,VLOOKUP(Q4,dbe,2,FALSE),IF(R4=25%,VLOOKUP(Q4,dbf,2,FALSE),IF(R4=20%,VLOOKUP(Q4,dbg,2,FALSE),VLOOKUP(Q4,dbh,2,FALSE)))))","v":23},null,{"$f":"IF(Cover!F33=0,91,Cover!F33)","v":91},0.25,"Net Purse: ",{"$f":"T3+T2","v":0},null,null,null,null,null,null,null,null,null,null,null,null,null,null,null,null,null,null,null,null,null,null,null,null,null,null,null,null,null,null,null,null,null,null,null,null,1,1,null,1,1,1,1,1,1,1,1]
[null,null,null,{"$f":"IF(C4=91,\"       To use this table, enter player divisions on Scores page\",IF(C4>75,\"Field limit exceeded. Use printed Payout tables.\",\"\"))","v":"       To use this table, enter player divisions on Scores page"},null,null,null,null,null,null,{"$f":"IF(J4=91,\"       To use this table, enter player divisions on Scores page\",IF(J4>30,\"Field limit exceeded. Use printed Payout tables.\",\"\"))","v":"       To use this table, enter player divisions on Scores page"},null,null,null,null,null,null,{"$f":"IF(Q4=91,\"       To use this table, enter player divisions on Scores page\",IF(Q4>30,\"Field limit exceeded. Use printed Payout tables.\",\"\"))","v":"       To use this table, enter player divisions on Scores page"},null,null,null,null,null,null,null,null,null,null,null,null,null,null,null,null,null,null,null,null,null,null,null,null,null,null,null,null,null,null,null,null,null,null,null,null,null,null,2,1,null,2,1,2,1,2,1,2,1]
[null,"Prelim","Proposed","Round to","Manual","Final",null,null,"Prelim","Proposed","Round to","Manual","Final",null,null,"Prelim","Proposed","Round to","Manual","Final",null,null,null,null,null,null,null,null,null,null,null,null,null,null,null,null,null,null,null,null,null,null,null,null,null,null,null,null,null,null,null,null,null,null,null,null,3,{"$f":"ROUND(0.33*BE6,0)","v":1},null,3,2,3,{"$f":"ROUND(0.25*BJ6,0)","v":1},3,1,3,1]
["Place","Factor","Local Pay","nearest 5","Adj. (Local)","Place",null,"Place","Factor","Local Pay","nearest 5","Adj. (Local)","Place",null,"Place","Factor","Local Pay","nearest 5","Adj. (Local)","Place",null,null,null,null,null,null,null,null,null,null,null,null,null,null,null,null,null,null,null,null,null,null,null,null,null,null,null,null,null,null,null,null,null,null,null,null,4,2,null,4,2,4,{"$f":"ROUND(0.25*BJ7,0)","v":1},4,1,4,1]
[{"$f":"IF(ROW()-7>$A$4,\"\",ROW()-7)","v":1},{"$f":"IF(A8>$A$4,\"\",IF(D$4=45%,VLOOKUP(A8,_pay5,$A$4+1),VLOOKUP(A8,_pay3,$A$4+1)))","v":7.0000000000000007E-2},{"$f":"IF(B8=\"\",\"\",$F$4*B8)","v":0},{"$f":"IF(C8=\"\",\"\",INT((C8+2.5)/5)*5)","v":0},null,null,null,{"$f":"IF(ROW()-7>$H$4,\"\",ROW()-7)","v":1},{"$f":"IF(K$4=45%,VLOOKUP(H8,_pay5,$H$4+1),VLOOKUP(H8,_pay3,$H$4+1))","v":7.0000000000000007E-2},{"$f":"IF(I8=\"\",\"\",$M$4*I8)","v":0},{"$f":"IF(J8=\"\",\"\",INT((J8+2.5)/5)*5)","v":0},null,null,null,{"$f":"IF(ROW()-7>$O$4,\"\",ROW()-7)","v":1},{"$f":"IF(R$4=45%,VLOOKUP(O8,_pay5,$O$4+1),VLOOKUP(O8,_pay3,$O$4+1))","v":7.0000000000000007E-2},{"$f":"IF(P8=\"\",\"\",$T$4*P8)","v":0},{"$f":"IF(Q8=\"\",\"\",INT((Q8+2.5)/5)*5)","v":0},null,null,null,null,null,null,null,null,null,null,null,null,null,null,null,null,null,null,null,null,null,null,null,null,null,null,null,null,null,null,null,null,null,null,null,null,null,null,5,{"$f":"ROUND(0.33*BE8,0)","v":2},null,5,2,5,{"$f":"ROUND(0.25*BJ8,0)","v":1},5,1,5,1]
[2,{"$f":"IF(A9=\"\",\"\",IF(D$4=45%,VLOOKUP(A9,_pay5,A$4+1),VLOOKUP(A9,_pay3,A$4+1)))","v":6.5000000000000002E-2},0,0,null,null,null,2,{"$f":"IF(H9=\"\",\"\",IF(K$4=45%,VLOOKUP(H9,_pay5,H$4+1),VLOOKUP(H9,_pay3,H$4+1)))","v":6.5000000000000002E-2},0,0,null,null,null,2,{"$f":"IF(O9=\"\",\"\",IF(R$4=45%,VLOOKUP(O9,_pay5,O$4+1),VLOOKUP(O9,_pay3,O$4+1)))","v":6.5000000000000002E-2},0,0,null,null,null,null,null,null,null,null,null,null,null,null,null,null,null,null,null,null,null,null,null,null,null,null,null,null,null,null,null,null,null,null,null,null,null,null,null,null,6,2,null,6,3,6,2,6,1,6,1]
[3,0.06,0,0,null,null,null,3,0.06,0,0,null,null,null,3,0.06,0,0,null,null,null,null,null,null,null,null,null,null,null,null,null,null,null,null,null,null,null,null,null,null,null,null,null,null,null,null,null,null,null,null,null,null,null,null,null,null,7,2,null,7,3,7,2,7,2,7,1]
{"$rows_left_out":189}
{"sheet":"Finance","index":6,"n_rows":46,"n_cols":20,"rows_kept":46,"cut":false,"hidden":false,"merged":[[10,11,10,13],[10,7,10,9],[8,11,8,13],[3,2,3,4],[5,0,5,2],[5,7,5,9],[5,11,5,14],[9,11,9,13],[9,0,9,4],[7,7,7,9],[39,8,39,13],[37,8,37,13],[38,8,38,13],[28,8,28,13],[36,8,36,13],[31,8,31,13],[35,8,35,13],[34,8,34,13],[29,8,29,13],[30,8,30,13],[38,0,38,4],[35,0,35,4],[36,0,36,4],[27,0,27,4],[34,0,34,4],[33,0,33,4],[37,0,37,4],[28,0,28,4],[32,0,32,4],[15,11,15,14],[26,8,26,13],[25,0,25,4],[7,11,7,13],[15,0,15,2],[15,7,15,9],[8,7,8,9],[9,7,9,9],[10,0,10,4],[8,0,8,4],[7,0,7,4],[31,0,31,4],[27,8,27,13],[25,8,25,13],[20,0,20,15],[21,0,21,15],[23,8,23,9],[26,0,26,4],[11,0,11,4],[12,0,12,4],[45,8,45,13],[40,0,40,4],[39,0,39,4],[41,0,41,4],[42,0,42,4],[44,8,44,13],[42,8,42,13],[44,0,44,4],[41,8,41,13],[40,8,40,13],[13,0,13,4],[14,0,14,4],[11,7,11,9],[12,7,12,9],[13,7,13,9],[14,7,14,9]]}
["PDGA International Tour Event: Financial Summary",null,null,null,null,null,null,null,null,null,null,null,null,null,"Currency > ",{"$f":"IF(Cover!M7=\"\",\"\",Cover!M7)","v":"Euro €"},"  (see Cover page cell M7)"]
[]
[]
["Part 1:",null,"Sponsors",null,null,null,"Please list all sponsors and their contributions."]
[]
["Cash Sponsors",null,null,null,null,null,{"$f":"IF(P1=\"\",\"\",P1)","v":"Euro €"},"  Non Cash Sponsors",null,null,null,"Description of Donation",null,null,null,{"$f":"IF(P1=\"\",\"\",P1)","v":"Euro €"}]
[]
[]
[]
[]
{"$rows_left_out":37}
{"sheet":"SupportData","index":7,"n_rows":40,"n_cols":7,"rows_kept":40,"cut":false,"hidden":true,"merged":[]}
["This worksheet contains data used by other worksheets and formulas in this file."]
["Please do not delete this worksheet or modify any data on it."]
[]
["Divcode",null,"Tier","Code","Fee","Tier 1","Tier 2"]
["MPO",null,"NT",1,5,"NT"]
["MPM",null,"A / XA",2,4,"A / XA"]
["MPG",null,"B / XB",3,3,"B / XB"]
["MPS",null,"C / XC",4,2,"C / XC"]
["MPL",null,"D",5,2,"D"]
["MPE",null,"A Pro / B Am",9,null,"Pro A","Am B"]
{"$rows_left_out":30}